program: Gaussian 09
title: 000081220
version: EM64L-G09RevD.01
frameworkgroup: C1[X(C18H14O)]
method: RPBEPBE
basis: SDD
operation: Freq
keyword: #pfreq=noraman
keyword: PBEPBE/SDD
title: #p freq=noraman PBEPBE/SDD
converged: NO YES NO NO
title: Mulliken charges:
elementType: O C C C C C C C C C C C C C C C C C C H H H H H H H H H H H H H H
charge: -0.301523 0.119854 0.320518 0.177625 -0.352502 -0.359113 -0.378625 -0.372732 -0.245578 -0.221198 0.371624 -0.222607 -0.222544 -0.241588 -0.364689 -0.391410 -0.209404 -0.194702 -0.255493 0.250083 0.270225 0.238392 0.240653 0.229916 0.230418 0.225208 0.225002 0.227317 0.266668 0.257162 0.226145 0.228070 0.228830
chargesum: 0.00000
title: Mulliken charges with hydrogens summed into heavy atoms:
elementType: O C C C C C C C C C C C C C C C C C C
charge: -0.301523 0.119854 0.320518 0.177625 -0.102419 -0.088888 -0.140234 -0.132079 -0.015661 0.009219 0.371624 0.002601 0.002458 -0.014271 -0.098020 -0.134248 0.016741 0.033368 -0.026664
polarizability: 2.18330827e+02 3.69793166e+00 2.09301921e+02 -5.72223437e+00 1.24647446e+01 1.46157200e+02
1716.lowfreq: -46.5737 -10.1959 -5.0850 -0.0005 0.0006 0.0009 2.9265 16.5627 34.0271
frequency: -46.5622 16.2290 34.0109 54.0126 80.6361 101.6596 184.8526 200.1410 232.2153 269.7980 324.0731 340.3101 388.1617 398.0603 410.3808 465.9601 485.8698 530.5024 551.3277 575.2673 600.6069 609.8286 615.3290 618.8579 690.7192 702.7475 709.6123 747.2542 751.5775 758.3811 766.6328 772.1712 831.6842 850.6522 855.0121 868.5080 902.2104 917.7917 946.6488 965.9212 972.4303 980.9133 984.3886 985.9163 987.7625 993.2216 995.3080 1019.9449 1031.5716 1043.7957 1077.2529 1078.3180 1105.2027 1159.6336 1168.9807 1170.8026 1171.5850 1181.5686 1186.0916 1212.5355 1253.0681 1291.9910 1308.5938 1309.8954 1365.5409 1370.2319 1386.1949 1425.2772 1428.8032 1442.0399 1463.8068 1472.5190 1496.1290 1580.2868 1585.6124 1593.2427 1604.2613 1609.4499 1617.2007 3122.5042 3129.2369 3130.3800 3131.4351 3139.5801 3141.3699 3141.9889 3150.6542 3156.0258 3157.5672 3164.8976 3165.7442 3169.7187 3174.9492
redmass: 3.9425 5.5676 3.9075 4.6757 4.7330 4.4996 4.6071 4.5265 5.0477 6.4805 4.1769 5.0095 5.3050 2.8238 2.9305 3.6876 3.1133 4.0055 3.9423 5.9405 5.3185 6.8763 6.2329 6.3746 2.2958 1.7178 5.0330 3.9134 2.5040 1.4757 1.9345 2.1093 1.2612 1.2464 4.5565 1.4916 1.4232 1.4160 1.3756 1.3620 1.3870 1.3101 1.3003 6.1533 6.0304 1.3259 6.9537 2.1098 2.1325 2.0173 1.5977 1.5089 1.8745 1.7077 1.1142 1.0752 1.0526 1.4113 1.1156 3.6701 1.7708 2.0662 1.3621 1.3428 9.2065 7.1706 8.9446 2.1958 2.2094 2.3442 2.2511 2.2571 2.9774 6.6552 6.0787 6.4008 6.6799 6.4936 6.6739 1.0843 1.0877 1.0849 1.0852 1.0893 1.0918 1.0909 1.0969 1.0941 1.0933 1.1018 1.0961 1.1006 1.1003
irintensity: 0.1410 0.8846 0.1328 1.1608 1.2412 0.9747 1.3676 0.3045 0.6058 1.9010 0.6048 1.7848 1.2620 0.0277 0.4237 10.5310 18.0802 9.7193 2.7576 2.5108 1.0586 4.8831 0.1465 0.9632 25.9759 52.7838 0.8496 17.5961 37.9589 86.7602 46.7866 32.9699 1.1616 0.2549 42.6722 3.3345 5.3719 0.9426 1.3828 0.2804 0.1026 0.1870 0.3313 0.4840 0.0226 0.1797 18.0145 11.6390 0.6423 15.5295 7.6347 14.2697 20.7381 21.0994 0.6148 10.7137 0.0117 14.3862 3.2730 393.0770 31.8301 0.7077 0.8879 0.7421 1.6437 0.0536 3.3634 48.4979 12.2193 3.9959 122.4912 107.5231 20.4160 46.1665 2.2796 35.1553 1.2553 46.3348 5.7300 1.7522 0.7642 2.5039 0.1434 12.1538 34.5558 0.6941 38.5849 45.0861 6.1378 23.7660 12.1098 20.0507 7.3361
temp: 298.150 k
press: 1.00000 atm
elementType: 8 6 6 6 6 6 6 6 6 6 6 6 6 6 6 6 6 6 6 1 1 1 1 1 1 1 1 1 1 1 1 1 1
symmnumber: 1
zpe: 683743.8 jmol-1
zpe.correction: 0.260424 hartree
zpe.thermalcorrener: 0.274789 hartree
zpe.thermalcorrenthalpy: 0.275733 hartree
zpe.thermalcorrgfe: 0.216900 hartree
zpe.sumelectzpe: -768.232258 hartree
zpe.sumelectthermal: -768.217894 hartree
zpe.sumelectthermalent: -768.216950 hartree
zpe.sumelectthermalfe: -768.275783 hartree
dipole: -0.4708 0.6840 0.5947
dipole: 1.0213
quadrupole: -100.9947 -100.2660 -105.2603
quadrupole: -1.0293 -1.2949 3.0132
quadrupole: 1.1790 1.9077 -3.0866 -1.0293 -1.2949 3.0132
hfenergy: -768.4926827 hartree
pointgroup: C01 [X(C18H14O1)]
dipole: 0.1838515 0.2298486 -0.2735438 debye
polarizability: 217.9704744|-5.0684854|204.6003819|-6.6658679|-20.7514338|151.2190917 unknown
InChI: InChI=1S/C18H14O/c1-3-9-15(10-4-1)17-13-7-8-14-18(17)19-16-11-5-2-6-12-16/h1-14H
charge 0 multiplicity 1
33 atoms
O  0.689977 0.008251 0.691796
C  -1.298603 1.096984 -0.138388
C  -2.051868 -0.195398 -0.019265
C  0.086113 1.179625 0.165985
C  -1.95063 2.282226 -0.564602
C  0.798881 2.396216 0.057433
C  -2.23565 -1.024615 -1.155197
C  -2.611917 -0.596532 1.220383
C  -1.252002 3.503998 -0.688828
C  0.125881 3.558301 -0.375432
C  1.987341 -0.396391 0.292731
C  -2.965336 -2.231016 -1.054682
C  -3.342562 -1.801923 1.321509
C  -3.521711 -2.623092 0.184328
C  2.557928 -0.071343 -0.960204
C  2.667933 -1.232409 1.206592
C  3.831882 -0.589001 -1.286979
C  3.937912 -1.742586 0.8642
C  4.529027 -1.421362 -0.381291
H  -3.019058 2.233395 -0.801765
H  1.860619 2.43176 0.320797
H  -1.803002 -0.723887 -2.116176
H  -2.469883 0.035406 2.104055
H  -1.777984 4.404734 -1.022075
H  0.675152 4.502571 -0.456866
H  -3.097832 -2.862736 -1.940282
H  -3.769694 -2.100113 2.285685
H  -4.087832 -3.558015 0.263285
H  2.018231 0.56031 -1.67203
H  2.189732 -1.472168 2.160832
H  4.275167 -0.342659 -2.258306
H  4.466261 -2.391159 1.571598
H  5.515528 -1.817673 -0.643241
