program: Gaussian 09
title: 000081183
version: EM64L-G09RevD.01
frameworkgroup: C1[X(C14H13N)]
method: RPBEPBE
basis: SDD
operation: Freq
keyword: #pfreq=noraman
keyword: PBEPBE/SDD
title: #p freq=noraman PBEPBE/SDD
converged: YES YES NO NO
title: Mulliken charges:
elementType: N C C C C C C C C C C C C C C H H H H H H H H H H H H H
charge: -0.247150 0.256252 0.249975 0.313953 0.283386 -0.621326 -0.644884 -0.408284 -0.407560 -0.427468 -0.421983 -0.245066 -0.246328 -0.240679 -0.239426 0.211551 0.227506 0.242229 0.229982 0.259518 0.248328 0.248169 0.236840 0.231846 0.227667 0.227732 0.227855 0.227364
chargesum: 0.00000
title: Mulliken charges with hydrogens summed into heavy atoms:
elementType: N C C C C C C C C C C C C C C
charge: 0.012368 0.256252 0.249975 0.313953 0.283386 -0.182268 -0.172674 -0.159956 -0.159391 -0.190629 -0.190137 -0.017399 -0.018596 -0.012824 -0.012063
polarizability: 2.17123258e+02 -8.50705124e-01 1.57358732e+02 -1.97880131e+00 2.22837209e-01 8.64833179e+01
1716.lowfreq: -12.7627 -11.8973 -9.1371 -0.0004 -0.0003 -0.0002 83.9209 99.6409 135.4226
frequency: 83.9101 99.6277 135.4162 145.3539 237.8430 270.4095 309.8110 339.0386 341.7830 407.0876 434.7139 479.9104 487.9919 494.6078 565.5053 574.5998 615.8708 618.4232 673.1548 704.3130 732.5923 757.9634 767.2646 782.1546 815.5014 826.8690 877.0090 888.4857 897.7033 947.4616 955.1229 981.6001 987.7411 988.1825 995.0460 1000.8732 1042.7033 1048.1744 1104.5889 1111.9828 1123.8915 1173.4793 1174.5544 1187.7338 1200.7323 1209.8779 1230.0291 1278.6083 1292.5517 1296.2853 1337.6501 1347.3476 1371.1763 1376.3570 1432.1086 1435.4418 1450.6717 1459.2841 1473.8533 1482.3634 1489.1190 1569.0434 1584.2023 1608.4118 1612.0397 2883.1604 2992.1294 3023.2867 3058.0004 3112.2484 3120.9682 3124.3580 3128.3769 3139.0539 3142.4786 3159.2881 3161.3670 3422.2406
redmass: 4.1051 3.9007 3.7679 3.8369 2.3783 4.3074 3.5678 3.6845 4.7007 2.9509 2.4853 4.2349 4.0457 3.4868 2.9863 2.8954 4.5518 5.4993 2.1881 3.7746 4.2269 1.2768 2.1249 2.0377 3.6870 3.1492 1.4134 1.5922 2.2307 1.4026 1.4233 1.7911 1.3275 1.3342 5.6820 2.1958 2.3033 2.1786 2.0432 4.2481 1.5782 1.0633 1.0713 1.5883 1.4714 2.5143 1.3294 1.4342 2.2362 1.4053 1.2475 1.3519 4.0392 7.4869 2.2552 2.2055 1.3573 1.1266 2.1365 1.1052 3.0982 6.0330 6.9356 6.3320 6.5434 1.0706 1.0622 1.0888 1.1009 1.0872 1.0852 1.0875 1.0890 1.0936 1.0942 1.1006 1.1007 1.0748
irintensity: 0.9587 0.3993 1.0020 2.3674 4.2753 0.2167 3.3329 2.1565 1.3769 0.8837 16.8303 0.2099 0.5871 13.3733 24.2334 22.4303 26.1141 17.2610 71.8491 5.7694 4.5974 136.0448 7.9070 14.0970 6.6313 0.9638 1.1723 0.5310 2.2590 3.1175 1.6969 4.2551 0.3508 0.0580 4.5115 1.0678 2.5889 7.8540 3.3405 16.9656 3.2220 0.1368 0.2133 7.4461 4.2433 5.2489 1.2317 2.4320 0.6548 0.7413 0.3857 7.6876 0.1649 0.1396 10.9024 10.7517 7.1792 11.7593 15.3776 9.2710 1.3980 0.6989 0.4084 0.0446 0.4284 65.8849 36.3085 39.3433 24.4805 10.6344 4.2377 2.3339 6.7433 26.3075 27.2624 44.7587 25.8133 2.0751
temp: 298.150 k
press: 1.00000 atm
elementType: 7 6 6 6 6 6 6 6 6 6 6 6 6 6 6 1 1 1 1 1 1 1 1 1 1 1 1 1
symmnumber: 1
zpe: 605263.5 jmol-1
zpe.correction: 0.230533 hartree
zpe.thermalcorrener: 0.241791 hartree
zpe.thermalcorrenthalpy: 0.242735 hartree
zpe.thermalcorrgfe: 0.193701 hartree
zpe.sumelectzpe: -594.992065 hartree
zpe.sumelectthermal: -594.980807 hartree
zpe.sumelectthermalent: -594.979863 hartree
zpe.sumelectthermalfe: -595.028897 hartree
dipole: -0.8140 -0.2910 0.6559
dipole: 1.0851
quadrupole: -77.6873 -82.1452 -90.7961
quadrupole: -3.4422 0.4153 2.4585
quadrupole: 5.8556 1.3976 -7.2532 -3.4422 0.4153 2.4585
hfenergy: -595.2225974 hartree
pointgroup: C01 [X(C14H13N1)]
dipole: -0.3194046 0.1172852 -0.2578155 debye
polarizability: 217.1144126|0.7430972|157.3466141|2.3254695|0.8619884|86.5042804 unknown
InChI: InChI=1S/C14H13N/c1-3-7-13-11(5-1)9-15-10-12-6-2-4-8-14(12)13/h1-8,15H,9-10H2
charge 0 multiplicity 1
28 atoms
N  0.009207 -2.63627 -0.021081
C  0.740688 0.514087 0.003431
C  -0.75297 0.515447 -0.029044
C  1.477094 -0.637704 -0.420542
C  -1.487189 -0.622557 0.435385
C  0.745636 -1.82354 -1.033983
C  -0.729601 -1.828466 0.991923
C  1.451243 1.654478 0.463741
C  -1.466131 1.650526 -0.49899
C  2.889138 -0.624534 -0.341836
C  -2.901697 -0.596156 0.398601
C  2.861184 1.659753 0.522567
C  -2.876856 1.665494 -0.524366
C  3.585837 0.512631 0.126047
C  -3.600907 0.535965 -0.076895
H  0.058827 -1.421551 -1.817712
H  1.47214 -2.486144 -1.538939
H  0.008034 -1.4763 1.737556
H  -1.423123 -2.509301 1.517051
H  -0.614939 -3.307096 -0.492784
H  0.888304 2.530656 0.805526
H  -0.905493 2.51642 -0.870034
H  3.44554 -1.514665 -0.658796
H  -3.460458 -1.468107 0.762099
H  3.390228 2.547595 0.886585
H  -3.408321 2.547992 -0.897622
H  4.680148 0.50429 0.178628
H  -4.696563 0.540357 -0.093717
