program: Gaussian 09
title: 000081175
version: EM64L-G09RevD.01
frameworkgroup: C1[X(C16H16Cl2N4O3)]
method: RPBEPBE
basis: SDD
operation: Freq
keyword: #p
keyword: freq=noraman
keyword: PBEPBE/SDD
title: #p freq=noraman PBEPBE/SDD
converged: YES YES NO NO
title: Mulliken charges:
elementType: Cl Cl O O O N N N N C C C C C C C C C C C C C C C C H H H H H H H H H H H H H H H H
charge: -0.003089 -0.007986 -0.427949 -0.214269 -0.213983 -0.133033 -0.053146 -0.114595 0.014688 -0.448723 -0.393647 0.460370 -0.317696 -0.322087 -0.338629 -0.659531 -0.295978 -0.358058 0.128579 0.470458 -0.190710 -0.255242 0.437664 -0.400948 -0.409688 0.228352 0.237075 0.249147 0.233406 0.249739 0.202268 0.236621 0.229434 0.239563 0.215224 0.225729 0.279130 0.257769 0.340273 0.311244 0.312259
chargesum: 0.00000
title: Mulliken charges with hydrogens summed into heavy atoms:
elementType: Cl Cl O O O N N N N C C C C C C C C C C C C C C C C
charge: -0.003089 -0.007986 -0.087677 -0.214269 -0.213983 -0.133033 -0.053146 -0.114595 0.014688 0.016704 0.088905 0.460370 0.134311 -0.085466 -0.109195 0.020985 -0.016849 -0.100290 0.128579 0.470458 -0.190710 -0.255242 0.437664 -0.089704 -0.097430
polarizability: 7.54456684e+02 -6.06390745e+00 2.25620220e+02 1.34701474e+01 3.95761040e+00 1.35403425e+02
1716.lowfreq: -2.9280 -0.3098 0.0016 0.0020 0.0023 5.9162 16.0257 17.6082 25.2991
frequency: 15.9148 17.6046 25.2034 36.7787 55.0289 60.9571 76.2547 81.6290 99.6750 114.9837 126.5977 129.4491 141.1398 159.7250 179.3240 202.3986 209.7664 218.3037 221.4780 256.0764 279.3166 303.2204 328.8142 340.4915 344.2359 357.9706 373.9584 394.1200 409.2536 436.6623 448.8207 486.5576 506.0692 509.6423 523.8892 540.7100 545.8604 565.5071 594.9576 628.5765 663.8257 693.6540 699.0351 731.4122 744.7794 751.7901 780.9505 790.4890 802.1071 830.7518 832.1042 850.1167 874.3597 897.2038 908.2590 914.2915 918.7613 967.6938 983.8133 984.8831 1002.1636 1018.2192 1037.3268 1040.1163 1077.9022 1113.7377 1119.1986 1126.6456 1146.8638 1172.0712 1177.6298 1190.4298 1194.7433 1206.0985 1256.4015 1276.8960 1277.4440 1309.3490 1328.0664 1337.1730 1342.0278 1354.5526 1363.2728 1367.6626 1373.5050 1376.0444 1391.3685 1398.7597 1409.9699 1414.8789 1458.4102 1465.8105 1468.2141 1479.1375 1484.5019 1505.3498 1518.7950 1543.1288 1548.2397 1578.8313 1625.0270 2962.6331 2986.8650 2994.9182 3023.9338 3048.4941 3069.6824 3085.2410 3094.4331 3098.1752 3152.0034 3153.0033 3172.3037 3176.8134 3189.5508 3192.3554 3560.6096
redmass: 5.5961 8.7035 9.8346 6.7523 4.1468 16.2781 5.7328 5.2150 3.6091 6.4128 2.9908 5.2871 8.1281 15.6857 6.6394 2.2924 3.3790 1.9189 7.6051 3.5682 1.4764 2.4986 6.2135 19.2453 8.0757 7.2995 3.2058 6.4668 5.9773 3.5253 3.6042 2.6799 4.8584 4.0474 4.1380 3.9181 3.4151 2.9471 5.3761 6.8400 6.1013 8.3495 5.8829 5.4513 4.9786 9.9659 1.5198 3.0073 1.2978 2.4641 1.9436 7.1212 9.2414 2.5230 1.3517 2.0407 1.4621 1.3474 1.3768 2.6447 2.5840 1.7223 2.9971 2.6628 1.9914 3.2863 1.7901 1.4026 2.2647 1.5529 1.5027 2.0242 2.0461 4.4972 1.3328 1.3780 2.6149 1.3910 1.2754 4.3471 1.3160 3.4699 1.7859 3.0078 2.6157 1.9819 1.2527 2.6132 3.1403 5.3027 1.0973 2.3034 1.0601 1.2862 1.1253 1.5487 1.8591 5.7128 9.8004 8.0421 6.4596 1.0680 1.0358 1.0611 1.0623 1.1019 1.1003 1.1003 1.0965 1.1013 1.0877 1.0871 1.0954 1.0960 1.0926 1.0934 1.0666
irintensity: 0.2795 0.1026 0.2741 0.8928 0.4345 0.0129 3.0089 0.9768 2.6413 2.7117 2.7408 10.2103 1.9016 2.5200 3.1245 4.2065 0.1556 2.5469 1.9818 40.0460 146.8729 39.7469 12.0854 0.3517 3.1010 1.0020 14.0656 5.6756 29.2207 3.8113 13.6807 3.4236 1.3143 17.2143 10.9887 4.1115 52.7267 4.8751 2.1534 0.0551 0.0725 10.7197 50.8839 18.4689 21.8269 73.1484 13.6993 12.2993 10.3932 12.0942 81.2355 54.1917 156.8491 44.3254 3.8661 7.2980 43.6839 1.7914 1.9870 1.8357 143.8627 35.2807 54.6260 51.7634 46.6282 11.8340 22.2610 13.6237 846.8571 107.6001 14.0793 62.1557 335.7093 1041.8627 158.5152 7.1877 3.0333 19.3238 55.9817 46.3647 85.2280 843.5811 40.1651 153.8795 235.9044 55.4279 22.7833 79.4504 27.5118 50.8808 3.5794 9.5880 6.9131 2.9010 18.3079 50.2197 41.6883 108.4843 39.9954 181.6244 584.5119 60.0687 30.2704 115.1470 28.8258 13.1407 3.2726 38.7297 24.6739 55.2979 4.9724 2.9121 15.1433 29.4466 7.4851 10.9847 12.6439
temp: 298.150 k
press: 1.00000 atm
elementType: 17 17 8 8 8 7 7 7 7 6 6 6 6 6 6 6 6 6 6 6 6 6 6 6 6 1 1 1 1 1 1 1 1 1 1 1 1 1 1 1 1
symmnumber: 1
zpe: 788364.1 jmol-1
zpe.correction: 0.300272 hartree
zpe.thermalcorrener: 0.324791 hartree
zpe.thermalcorrenthalpy: 0.325735 hartree
zpe.thermalcorrgfe: 0.242377 hartree
zpe.sumelectzpe: -1982.129469 hartree
zpe.sumelectthermal: -1982.104950 hartree
zpe.sumelectthermalent: -1982.104005 hartree
zpe.sumelectthermalfe: -1982.187364 hartree
dipole: 15.3075 -1.3165 1.5444
dipole: 15.4414
quadrupole: -153.2350 -158.6662 -159.8409
quadrupole: -13.7436 9.5694 8.7353
quadrupole: 4.0124 -1.4188 -2.5935 -13.7436 9.5694 8.7353
hfenergy: -1982.4297407 hartree
pointgroup: C01 [X(C16H16Cl2N4O3)]
dipole: 6.0449819 -0.4281195 0.4267672 debye
polarizability: 753.4603872|-20.0287191|214.1685627|-20.4149587|-30.3695338|147.8513794 unknown
InChI: InChI=1S/C16H16Cl2N4O3/c1-2-21(7-8-23)12-5-3-11(4-6-12)19-20-16-14(17)9-13(22(24)25)10-15(16)18/h3-6,9-10,23H,2,7-8H2,1H3
charge 0 multiplicity 1
41 atoms
Cl -2.310256 -2.144748 1.682528
Cl -2.686237 2.405587 -1.600853
O  7.365881 -0.585697 -2.084119
O  -7.405011 -0.862774 1.23561
O  -7.581378 1.006277 -0.070316
N  5.179938 -0.076408 0.0434
N  -0.443001 -0.710929 -0.243816
N  -1.212019 0.34072 -0.064954
N  -6.889939 0.079923 0.512811
C  6.069384 -1.248852 -0.043743
C  5.837425 1.242866 0.218085
C  3.798419 -0.207205 -0.032928
C  6.494003 -1.609014 -1.487653
C  2.931604 0.924619 0.19376
C  3.176541 -1.468839 -0.337336
C  6.000665 1.651282 1.699422
C  1.545659 0.800313 0.128459
C  1.785485 -1.584904 -0.398986
C  0.940625 -0.462093 -0.165828
C  -2.598795 0.13805 0.026036
C  -3.260302 -0.869915 0.803857
C  -3.450923 1.120284 -0.575682
C  -5.426904 0.101608 0.344642
C  -4.650095 -0.89377 0.975909
C  -4.840834 1.119769 -0.441713
H  5.578985 -2.123558 0.422075
H  6.974598 -1.04092 0.558682
H  6.820287 1.182068 -0.279065
H  5.267309 2.007605 -0.337573
H  5.612208 -1.64831 -2.146949
H  6.984566 -2.606078 -1.488911
H  3.359273 1.90061 0.437182
H  3.783066 -2.353989 -0.544443
H  5.023332 1.727839 2.206709
H  6.610399 0.912713 2.251208
H  6.506456 2.631444 1.770668
H  0.895392 1.662996 0.305052
H  1.311231 -2.543428 -0.633809
H  8.282125 -0.68322 -1.720259
H  -5.141467 -1.660969 1.57855
H  -5.471493 1.870046 -0.92321
