program: Gaussian 09
title: 000081178
version: EM64L-G09RevD.01
frameworkgroup: C1[X(C13H20O4S)]
method: RPBEPBE
basis: SDD
operation: Freq
keyword: #p
keyword: freq=noraman
keyword: PBEPBE/SDD
title: #p freq=noraman PBEPBE/SDD
converged: YES YES NO NO
title: Mulliken charges:
elementType: S O O O O C C C C C C C C C C C C C H H H H H H H H H H H H H H H H H H H H
charge: 0.974317 -0.292793 -0.388433 -0.506057 -0.513842 -0.372087 -0.241856 -0.350829 -0.200174 -0.309231 -0.053633 -0.683139 -0.192559 -0.264248 0.452905 -0.357828 -0.387803 -0.800554 0.215659 0.194466 0.185980 0.189079 0.193200 0.195691 0.209296 0.184878 0.216051 0.265460 0.219174 0.206084 0.214863 0.319619 0.292293 0.236433 0.245623 0.231734 0.242462 0.229799
chargesum: 0.00000
title: Mulliken charges with hydrogens summed into heavy atoms:
elementType: S O O O O C C C C C C C C C C C C C
charge: 0.974317 -0.292793 -0.388433 -0.506057 -0.513842 0.038039 0.133204 0.038063 0.193999 0.172279 -0.053633 -0.043018 0.127060 0.028045 0.452905 -0.121395 -0.142181 -0.096560
polarizability: 2.05787105e+02 -5.25633044e-01 2.23189078e+02 -2.20033916e+00 -3.95291585e+00 1.22882405e+02
1716.lowfreq: -35.3307 -6.8438 -2.7803 -0.0025 -0.0023 -0.0020 4.3333 16.6033 23.5961
frequency: -35.2693 16.2337 23.5389 30.6025 36.1554 54.1665 71.2126 88.4378 105.6428 116.7827 130.6734 148.0536 162.0024 180.8138 226.6051 227.6939 232.9930 259.8183 274.4703 284.1177 323.4451 353.9396 370.8879 396.7596 407.0572 428.2348 446.5193 472.5049 505.5116 547.6361 590.1336 620.3754 703.1471 742.7004 776.3668 808.8096 815.6627 824.1088 830.2398 841.6368 846.7408 903.2689 938.2838 957.8362 962.9853 979.3964 982.3316 987.6026 994.6718 1005.6147 1035.5324 1048.9155 1053.2201 1065.3959 1082.0204 1099.7836 1124.4700 1127.1347 1149.8398 1192.7762 1208.6828 1215.4758 1219.2448 1256.5432 1272.8972 1273.9622 1285.5511 1308.8432 1338.4596 1351.6759 1356.0971 1381.2828 1391.2498 1394.2564 1399.3355 1403.4930 1446.7227 1456.0483 1469.0564 1469.7667 1473.7097 1474.0313 1477.0912 1477.5281 1484.1830 1491.8098 1592.2968 1594.4184 2911.9894 2922.8860 2961.5058 2966.0375 2967.8245 2975.5657 2981.4068 2984.7557 2986.1317 3010.9989 3042.3971 3050.4390 3062.1768 3072.4226 3077.3893 3092.8802 3127.6599 3139.1879 3144.5813 3166.9058
redmass: 1.0181 4.1629 1.9183 3.8392 3.1763 4.5357 3.7904 4.7914 3.9505 1.9962 5.0652 4.2421 5.5491 4.6353 1.4234 3.4187 4.3023 3.2038 4.9892 3.9112 4.2929 3.4488 4.5163 5.7616 3.0276 2.8357 5.2152 4.7551 3.2694 4.0120 6.1836 6.9554 3.3286 1.0739 4.9420 1.1386 2.7109 1.8254 3.9315 3.3637 1.2499 1.7504 1.1604 11.8491 1.3190 3.2000 1.5398 1.9719 2.7636 2.4597 3.1369 1.5898 2.4828 4.0177 2.2899 2.5114 1.3291 2.5325 1.4880 1.1322 1.1804 1.2860 2.9498 1.1142 1.2635 1.1687 1.0870 1.2590 1.2724 1.3617 1.3954 6.1456 1.2214 2.5059 1.3033 1.4461 1.0705 1.0880 1.0761 1.0762 1.1215 1.0632 1.0698 1.9507 1.0714 1.0906 6.6171 6.0493 1.0554 1.0579 1.1046 1.0639 1.0590 1.0368 1.0383 1.0600 1.0968 1.0998 1.1029 1.1035 1.0961 1.1007 1.0997 1.0994 1.0891 1.0899 1.0980 1.0960
irintensity: 0.5275 0.6080 1.2180 0.3343 0.1830 1.5631 0.6799 0.3323 0.1418 0.6523 6.7972 2.5207 5.4264 1.0289 1.8662 9.9570 0.7030 3.3855 2.9151 7.5344 1.6662 5.6325 5.1930 20.5563 1.5513 6.0300 26.1422 41.7165 66.9288 55.4444 33.3082 1.9803 1.4347 8.6145 5.3980 0.7597 17.5018 97.1799 35.3208 45.2579 1.2192 9.5383 0.4682 90.2991 4.8071 30.4491 5.5575 4.1371 3.3573 37.3360 6.6325 16.4404 16.9018 113.2106 9.7280 5.0143 8.6317 1.9105 1.9365 9.6410 8.2087 10.1049 2.6725 2.1273 0.1225 0.4327 0.0890 1.9952 14.0585 15.4444 15.7586 3.8994 10.3777 18.0918 13.7530 2.3259 18.2504 12.0908 1.8767 15.3548 16.7583 1.9664 10.4649 23.3129 6.6697 10.9806 7.5855 6.7652 34.9723 106.3036 42.1416 27.0945 33.8772 26.2423 24.4614 67.7845 47.6425 3.7569 29.7920 35.2890 17.1405 96.1494 52.7538 16.0157 28.1005 5.5808 24.0530 7.5366
temp: 298.150 k
press: 1.00000 atm
elementType: 16 8 8 8 8 6 6 6 6 6 6 6 6 6 6 6 6 6 1 1 1 1 1 1 1 1 1 1 1 1 1 1 1 1 1 1 1 1
symmnumber: 1
zpe: 805220.6 jmol-1
zpe.correction: 0.306692 hartree
zpe.thermalcorrener: 0.327131 hartree
zpe.thermalcorrenthalpy: 0.328075 hartree
zpe.thermalcorrgfe: 0.254199 hartree
zpe.sumelectzpe: -1204.740226 hartree
zpe.sumelectthermal: -1204.719787 hartree
zpe.sumelectthermalent: -1204.718843 hartree
zpe.sumelectthermalfe: -1204.792719 hartree
dipole: -5.1824 3.8163 -2.4687
dipole: 6.8932
quadrupole: -118.0905 -98.7405 -123.7157
quadrupole: 16.4442 -1.0523 3.8308
quadrupole: -4.5750 14.7751 -10.2001 16.4442 -1.0523 3.8308
hfenergy: -1205.0469181 hartree
pointgroup: C01 [X(C13H20O4S1)]
dipole: -1.2284676 -2.2130056 0.9738541 debye
polarizability: 208.3452711|-6.2324548|220.3984198|5.2730426|-3.8391977|123.114897 unknown
InChI: InChI=1S/C13H20O4S/c1-3-4-9-16-10-11-17-18(14,15)13-7-5-12(2)6-8-13/h5-8H,3-4,9-11H2,1-2H3
charge 0 multiplicity 1
38 atoms
S  1.374151 2.362545 -0.469337
O  -2.296321 1.029167 0.153531
O  0.128112 2.704084 0.925359
O  2.702685 3.237739 -0.184515
O  0.563492 2.529798 -1.868363
C  -3.297867 -1.137731 -0.318311
C  -3.358659 0.103436 0.576896
C  -4.430918 -2.144281 -0.010125
C  -2.28676 2.260216 0.950269
C  -1.18101 3.180928 0.441962
C  1.750162 0.561761 -0.116067
C  -4.361212 -3.401908 -0.902727
C  0.710074 -0.373664 -0.246157
C  3.06449 0.23137 0.245485
C  2.347081 -2.127022 0.348996
C  1.029677 -1.726975 -0.007724
C  3.351558 -1.132699 0.477012
C  2.6706 -3.592471 0.573892
H  -3.356402 -0.816136 -1.376036
H  -2.315516 -1.63349 -0.185437
H  -4.349315 0.603474 0.479451
H  -3.216571 -0.171798 1.646483
H  -4.381896 -2.44414 1.056684
H  -5.41199 -1.646652 -0.150346
H  -2.12742 2.024858 2.024729
H  -3.263855 2.786276 0.846886
H  -1.322329 4.207082 0.831013
H  -1.189112 3.206682 -0.667767
H  -5.182663 -4.10464 -0.673218
H  -3.405509 -3.940091 -0.757207
H  -4.434382 -3.131993 -1.972737
H  -0.309525 -0.052866 -0.487511
H  3.827994 1.009546 0.342453
H  0.241648 -2.484499 -0.096361
H  4.369198 -1.424119 0.7600
H  1.888634 -4.091245 1.174078
H  2.73583 -4.133269 -0.389718
H  3.635147 -3.721571 1.093186
