program: Gaussian 09
title: 000081134
version: EM64L-G09RevD.01
frameworkgroup: C1[X(C8H7NO5)]
method: RPBEPBE
basis: SDD
operation: Freq
keyword: #pfreq=noraman
keyword: PBEPBE/SDD
title: #p freq=noraman PBEPBE/SDD
converged: YES YES NO NO
title: Mulliken charges:
elementType: O O O O O N C C C C C C C C H H H H H H H
charge: -0.275919 -0.388213 -0.170229 -0.265823 -0.195968 0.025702 0.297954 0.343677 0.029306 0.496968 -0.509269 -0.558111 -0.205353 -0.501662 0.304772 0.292435 0.178547 0.221145 0.263588 0.239868 0.376585
chargesum: 0.00000
title: Mulliken charges with hydrogens summed into heavy atoms:
elementType: O O O O O N C C C C C C C C
charge: -0.275919 -0.011628 -0.170229 -0.265823 -0.195968 0.025702 0.297954 0.343677 0.029306 0.496968 -0.204497 -0.265675 -0.026806 0.222938
polarizability: 1.73025314e+02 -2.05245328e+00 1.55843898e+02 5.18791021e-01 -2.75417502e+00 4.86196947e+01
1716.lowfreq: -5.8098 -0.0008 -0.0001 0.0005 2.1718 4.0196 40.8428 68.4820 95.5237
frequency: 40.8043 68.4818 95.5213 115.9296 141.9549 150.6554 201.0893 208.2352 225.0347 297.1222 343.0272 372.4626 381.7098 390.8358 435.1285 476.9235 502.6388 582.5408 598.1778 683.9708 691.0638 719.9576 730.9093 783.6834 865.8189 889.6825 893.8924 916.3494 935.4459 995.7953 1031.9502 1108.9756 1112.9906 1129.0299 1156.4142 1183.5385 1244.2916 1283.8778 1310.1408 1359.5393 1387.3431 1411.0179 1444.3057 1452.6323 1457.4908 1468.2681 1491.9842 1582.1519 1604.0952 1620.8876 2811.8774 2886.4688 2998.2317 3112.3030 3146.3627 3164.8870 3168.1669
redmass: 2.2476 6.8165 5.0583 4.4149 2.2985 8.8113 3.1831 3.2917 5.1732 4.8071 6.4399 6.0168 6.2922 6.2926 8.8143 5.9592 5.7590 5.3526 4.5139 7.7625 7.6638 8.2496 5.6856 5.5725 8.1374 1.0736 1.4303 7.3031 1.3895 1.8384 3.3864 1.3011 1.8518 7.1692 1.5289 1.8748 2.8320 3.7871 2.6430 2.9162 1.6960 3.8887 1.3053 2.9074 1.1106 1.0688 3.8229 4.4613 6.5871 7.2380 1.0672 1.0857 1.0328 1.0996 1.1061 1.0918 1.0922
irintensity: 6.5013 0.1976 7.9128 5.6711 4.7662 7.6830 3.6936 1.5978 2.3803 6.0381 5.7917 0.5934 9.7457 0.9849 1.1369 5.8526 8.3599 23.7918 11.6072 3.7585 8.7856 17.4218 14.4783 4.5317 24.8467 138.9292 26.8073 16.7661 1.7233 16.7084 31.3344 8.5689 132.6886 203.2217 3.0572 5.1521 31.5600 177.3681 582.0962 57.5012 47.3088 5.3993 41.3380 83.7655 10.2146 41.3984 74.6322 33.6447 176.0967 138.4854 264.5107 95.0746 58.2020 31.6392 11.2051 5.4363 6.0914
temp: 298.150 k
press: 1.00000 atm
elementType: 8 8 8 8 8 7 6 6 6 6 6 6 6 6 1 1 1 1 1 1 1
symmnumber: 1
zpe: 376010.6 jmol-1
zpe.correction: 0.143215 hartree
zpe.thermalcorrener: 0.155995 hartree
zpe.thermalcorrenthalpy: 0.156939 hartree
zpe.thermalcorrgfe: 0.103204 hartree
zpe.sumelectzpe: -738.793201 hartree
zpe.sumelectthermal: -738.780421 hartree
zpe.sumelectthermalent: -738.779477 hartree
zpe.sumelectthermalfe: -738.833211 hartree
dipole: -1.4357 1.8441 0.9290
dipole: 2.5150
quadrupole: -102.5854 -75.9190 -79.6582
quadrupole: -10.1221 0.1309 3.5588
quadrupole: -16.5312 10.1352 6.3960 -10.1221 0.1309 3.5588
hfenergy: -738.9364156 hartree
pointgroup: C01 [X(C8H7N1O5)]
dipole: 0.2577672 -0.8523516 0.4313808 debye
dipolederiv: -0.2718242 -0.2237842 0.0463183 -0.1843979 -1.7118254 0.1767669 -0.036749 -0.0433558 -0.328829 -0.8845081 0.4893331 -0.0025492 0.3321719 -0.8754122 0.0081089 0.0056302 0.0040275 -0.333659 -0.5708223 -0.1962617 -0.0161768 -0.4236852 -0.8134197 -0.0280053 -0.0200231 -0.0259824 -0.2013032 -0.8414524 0.1247121 -0.0168818 0.3040571 -0.5909034 0.0090612 -0.0274925 -0.0025307 -0.2724056 -1.1918963 0.4006398 -0.0636382 0.0544988 -0.4378337 0.006225 -0.0536958 0.0264501 -0.327513 1.8494424 0.3170301 0.0722675 0.3234487 1.165255 0.035727 0.0781904 0.0441475 0.2114178 -0.2391744 0.899117 -0.12188 0.3948142 1.4293701 -0.0382032 -0.0296183 0.1710428 0.0434545 -0.8997723 -0.3487105 -0.0434706 -0.0431676 -0.2835476 -0.0047976 -0.0476113 -0.0219992 0.0474029 0.7366093 -0.8497547 0.0222645 -0.1322323 0.5765242 0.0208975 0.0018331 -0.0779583 0.082972 -0.6829117 0.1799403 -0.0466846 0.3706554 -0.4387438 0.0283947 -0.0538663 0.0276491 0.0127804 0.114219 0.1675044 0.0169586 -0.1275437 -0.0260979 0.025256 0.0424719 0.0627501 -0.1019798 0.4806556 -0.0103554 0.0398825 -0.2571168 -0.2144648 -0.0019307 0.0403735 0.0033184 -0.1311078 1.470401 -0.532581 0.0978778 -0.5502861 1.0165343 -0.0488439 0.0865625 -0.047523 0.1152498 0.1910181 -0.2808322 0.0429765 0.0243459 0.8340061 -0.1451317 -0.0046555 -0.2344188 0.3710904 0.0749738 -0.0684963 -0.0007737 -0.0047256 0.1244385 -0.0022759 0.000773 -0.005549 0.1631604 0.1216631 -0.027215 -0.0040917 0.0003686 0.0574468 0.0005478 -0.0091087 -0.0020005 0.177893 -0.0057707 -0.1740918 -0.0057079 -0.0140018 -0.2095399 0.0048179 -0.0046155 -0.0078344 0.1120854 0.0825586 0.0921781 -0.0490965 -0.0061205 -0.0148816 -0.0814985 -0.0177325 0.0634111 -0.1503061 -0.0169734 0.1577436 0.0446537 0.0276998 0.0745121 0.0096182 0.0678494 0.0316461 0.0393862 0.0084281 -0.1466515 -0.0146765 -0.0869832 -0.0872867 0.0209254 -0.0204641 0.0200722 0.1068595 0.4751365 0.030536 0.0024281 -0.0017996 0.4258695 0.0043404 0.0019487 0.0146372 0.363351 unknown
polarizability: 169.273535|-6.9230867|159.179203|6.3951153|-4.4351794|49.0361692 unknown
InChI: InChI=1S/C8H7NO5/c1-14-7-3-5(4-10)2-6(8(7)11)9(12)13/h2-4,11H,1H3
charge 0 multiplicity 1
21 atoms
O  -1.381876 -2.480953 -0.09603
O  1.44496 -1.872619 0.05299
O  2.639416 2.133231 0.18064
O  3.201791 -0.072858 0.170248
O  -3.690772 2.092962 -0.225874
N  2.298729 0.900408 0.143067
C  -0.88084 -1.188113 -0.01474
C  0.890966 0.529034 0.070908
C  0.521237 -0.862461 0.044658
C  -1.429958 1.219644 -0.078916
C  -1.822713 -0.150052 -0.08341
C  -0.070455 1.563285 0.007345
C  -2.450978 2.296189 -0.15279
C  -0.730729 -3.602178 0.624508
H  -2.88663 -0.400742 -0.144378
H  0.263224 2.605397 0.024131
H  -2.036224 3.33532 -0.138634
H  -0.561658 -3.336568 1.683702
H  0.222333 -3.876626 0.150013
H  -1.460076 -4.422231 0.551899
H  2.376053 -1.42337 0.094765
