program: Gaussian 09
title: 000081120
version: EM64L-G09RevD.01
frameworkgroup: C1[X(C6H7ClN2O3S)]
method: RPBEPBE
basis: SDD
operation: Freq
keyword: #p
keyword: freq=noraman
keyword: PBEPBE/SDD
title: #p freq=noraman PBEPBE/SDD
converged: YES YES NO NO
title: Mulliken charges:
elementType: Cl S O O O N N C C C C C C H H H H H H H
charge: -0.052056 0.993207 -0.569424 -0.507764 -0.507300 -0.403461 -0.567115 -0.096701 0.591110 -0.229059 -0.208477 -0.298275 -0.324384 0.301315 0.279691 0.288980 0.308167 0.379845 0.310860 0.310841
chargesum: 0.00000
title: Mulliken charges with hydrogens summed into heavy atoms:
elementType: Cl S O O O N N C C C C C C
charge: -0.052056 0.993207 -0.189579 -0.507764 -0.507300 -0.095294 0.054586 -0.096701 0.591110 0.072256 0.071214 -0.298275 -0.035404
polarizability: 1.95239537e+02 -2.73967742e+00 1.31075380e+02 5.91221963e-01 2.74812475e-01 7.09228259e+01
1716.lowfreq: -3.9847 -0.0008 0.0008 0.0009 6.2738 7.7141 27.5774 64.5329 107.3124
frequency: 27.5685 64.5284 107.3108 122.9989 145.7443 170.8940 177.8506 206.1827 231.8314 237.3072 294.5743 299.2371 317.3685 365.6905 370.5720 394.0328 418.4351 444.4312 474.2050 523.9727 559.0038 579.1882 588.8125 638.1682 705.0828 734.1238 813.3013 834.8699 848.1976 888.4382 965.8727 981.8730 1009.7631 1044.5969 1061.6612 1123.0726 1171.7903 1233.2457 1236.2594 1324.6720 1367.7011 1424.0847 1457.7684 1500.9796 1575.4623 1599.6996 1665.9735 3162.3866 3168.7231 3183.1498 3464.0612 3470.6363 3479.1251 3599.6143
redmass: 8.5362 5.2870 9.3498 4.3479 3.9836 2.0866 5.1342 5.6457 6.3666 4.4451 2.2162 4.0505 1.9195 6.6825 6.8681 9.5428 8.6169 3.4755 1.3598 8.9846 5.4831 3.6835 1.2025 6.9498 8.0022 3.8017 6.1827 10.9234 1.4335 1.3873 16.3889 1.3436 5.3981 1.1912 2.0669 1.4999 2.7386 1.1786 1.3628 2.1654 3.8682 5.7717 2.2959 2.2684 5.1542 4.4355 1.2122 1.0891 1.0932 1.0958 1.0468 1.0701 1.0660 1.1061
irintensity: 2.0389 2.2775 0.0323 3.8169 5.3689 32.1876 16.3060 7.8873 6.1867 18.6523 63.4847 63.5336 22.4485 9.8124 8.7099 3.6299 95.6117 3.7736 246.5369 119.8635 9.9268 26.9411 126.7145 34.3764 20.8621 3.0325 13.8996 78.7959 41.4704 18.6867 85.5586 1.7248 44.9512 65.7872 104.1467 45.9286 7.8791 0.6559 3.0774 16.6380 37.6780 5.6834 39.5552 71.6655 5.1892 150.1575 71.3371 1.9521 8.5752 0.2039 9.4536 45.8630 38.5035 8.5846
temp: 298.150 k
press: 1.00000 atm
elementType: 17 16 8 8 8 7 7 6 6 6 6 6 6 1 1 1 1 1 1 1
symmnumber: 1
zpe: 346056.3 jmol-1
zpe.correction: 0.131806 hartree
zpe.thermalcorrener: 0.145849 hartree
zpe.thermalcorrenthalpy: 0.146793 hartree
zpe.thermalcorrgfe: 0.090364 hartree
zpe.sumelectzpe: -1424.949622 hartree
zpe.sumelectthermal: -1424.935579 hartree
zpe.sumelectthermalent: -1424.934635 hartree
zpe.sumelectthermalfe: -1424.991064 hartree
dipole: 7.3664 -2.0982 1.4781
dipole: 7.8007
quadrupole: -72.6355 -90.5605 -93.5307
quadrupole: -9.2755 -8.6425 0.3765
quadrupole: 12.9401 -4.9849 -7.9551 -9.2755 -8.6425 0.3765
hfenergy: -1425.0814279 hartree
pointgroup: C01 [X(C6H7Cl1N2O3S1)]
dipole: -2.9765343 -0.5873783 -0.4629074 debye
dipolederiv: -0.3574689 0.2686411 0.0186094 0.3223668 -0.5853911 -0.0286442 0.0104745 -0.0228679 -0.0511659 2.4272861 -0.0081723 -0.1288 0.0541892 1.1921807 -0.0156085 -0.3436589 -0.0146116 1.668401 -0.6013588 0.0057179 0.2355593 -0.011316 -0.5525409 0.0174987 0.4096875 0.0129339 -1.0164763 -0.7546337 -0.0519166 -0.0109477 -0.1518249 -0.5931722 -0.1156183 0.0105335 -0.0339301 -0.5202975 -0.7682441 0.0738801 -0.0154432 0.1399876 -0.5937328 0.1108881 0.0173653 0.0325084 -0.5131814 -1.1532175 0.0025318 0.0243067 0.0391477 0.0914913 0.0133493 0.022229 0.0168259 -0.4697698 -0.4455754 0.2077866 0.0144105 0.4658299 -0.3007687 -0.0170696 0.0196981 -0.0115453 0.0022396 -0.6478731 -0.0060893 0.002712 -0.0074316 -0.235309 -0.0006158 -0.2004407 -0.0060975 -0.1922351 1.6176782 0.293065 -0.0276233 0.040012 -0.2157209 -0.0144546 -0.0235821 -0.0153219 0.1604105 0.1753209 0.0466923 0.0005338 -0.2662182 -0.1292392 0.0051687 0.0162741 0.0079325 -0.0124647 0.2299193 0.0815419 -0.0020855 0.3613093 0.0988258 -0.0073473 0.0343248 -0.0102027 -0.0722569 -0.1350282 -0.4737438 -0.0127127 -0.8806317 0.7850817 0.0567708 -0.0124125 0.0368106 -0.1177527 -0.5038953 -0.1178924 0.0100151 0.3307307 0.0266915 -0.0019229 0.0314293 0.0101181 -0.1896438 0.1489159 -0.0478174 -0.0082831 -0.0105683 0.0893297 -0.0002843 -0.0069008 -0.0086557 0.1580604 0.1091934 0.0675611 -0.0038993 0.0359556 0.0683052 -0.005732 -0.0044016 0.0044291 0.1537515 0.0799073 -0.0202106 0.0020545 -0.020207 0.0171108 -0.0033144 -0.0095217 -0.0032381 0.1785889 0.1897551 -0.0404442 0.000887 -0.1129973 0.0601813 -0.0043334 -0.0059161 -0.0078152 0.3427341 0.0807227 -0.0068605 -0.0913725 -0.0086794 0.3492863 -0.0002636 0.0448317 0.0038865 0.2598458 0.1491894 -0.1355257 -0.0800986 -0.1556273 0.2119378 0.0555326 -0.0437213 0.0223161 0.1181727 0.1594065 -0.1387452 0.0721776 -0.1640271 0.2154527 -0.0439994 0.0337079 -0.0134751 0.1130396 unknown
polarizability: 195.0643397|-1.986049|130.975637|-5.3256017|1.8292238|71.1977657 unknown
InChI: InChI=1S/C6H7ClN2O3S/c7-5-3-4(13(10,11)12)1-2-6(5)9-8/h1-3,9-10H,8H2
charge 0 multiplicity 1
20 atoms
Cl -2.20264 2.673522 0.192483
S  2.696363 0.013329 0.02485
O  2.891086 0.063676 -1.829036
O  3.222946 1.423378 0.621833
O  3.310002 -1.388515 0.55435
N  -3.347467 -0.134569 0.124275
N  -4.061974 -1.336727 0.09931
C  0.848507 -0.043619 0.047549
C  -1.957562 -0.123677 0.097935
C  0.151901 1.178773 0.093648
C  0.206495 -1.295538 0.022336
C  -1.243783 1.113827 0.123526
C  -1.196189 -1.329136 0.053176
H  0.684094 2.134133 0.123004
H  0.794776 -2.217735 -0.003326
H  -1.749947 -2.270969 0.039894
H  -3.835487 0.76636 0.158649
H  3.873185 0.097632 -2.02326
H  -4.568348 -1.526389 -0.768529
H  -4.545659 -1.575655 0.967834
