program: Gaussian 09
title: 000081111
version: EM64L-G09RevD.01
frameworkgroup: C1[X(C5H7N3O2)]
method: RPBEPBE
basis: SDD
operation: Freq
keyword: #pfreq=noraman
keyword: PBEPBE/SDD
title: #p freq=noraman PBEPBE/SDD
converged: YES YES NO NO
title: Mulliken charges:
elementType: O O N N N C C C C C H H H H H H H
charge: -0.387310 -0.278515 -0.410727 -0.051502 -0.617033 0.053824 0.123324 0.092239 0.188716 -0.833846 0.326586 0.226662 0.293412 0.226926 0.321004 0.354300 0.371940
chargesum: 0.00000
title: Mulliken charges with hydrogens summed into heavy atoms:
elementType: O O N N N C C C C C
charge: -0.015370 -0.278515 -0.084140 -0.051502 0.058271 0.053824 0.123324 0.092239 0.188716 -0.086845
polarizability: 1.15247439e+02 1.20202075e+00 9.70403039e+01 -8.25160577e-03 2.61599393e-03 3.95439543e+01
1716.lowfreq: -8.3705 -7.6834 -3.2841 -0.0007 -0.0006 -0.0005 103.9042 125.0364 171.7955
frequency: 103.9037 125.0210 171.7955 198.3266 277.1757 291.6160 303.4056 315.5400 348.7256 430.6855 461.4515 515.7219 519.8798 587.4368 612.0059 631.3843 672.7758 704.6434 750.3966 754.7036 911.3921 989.4285 1034.8844 1043.0379 1098.7310 1141.1162 1204.0655 1294.3767 1307.9673 1377.4800 1406.9311 1465.5348 1489.4932 1495.8681 1553.0697 1587.5541 1623.9942 1645.9912 2952.7019 3022.9642 3089.7406 3514.4058 3558.0147 3560.7205 3709.8063
redmass: 3.6022 1.0361 6.7014 5.7783 2.9066 1.9347 1.4975 3.4534 6.9536 1.1803 6.1517 1.1393 9.5769 3.6475 8.3824 2.0133 4.8091 2.9645 5.4060 6.7810 1.9615 3.8157 1.5272 1.4177 3.7921 4.6657 1.6462 4.2654 1.6526 2.1287 1.6959 1.2904 1.0448 3.5922 6.0504 2.0974 2.4797 3.8414 1.0392 1.0990 1.0939 1.0776 1.0463 1.0642 1.1053
irintensity: 5.2258 0.0164 3.8423 8.5920 1.2761 49.1019 56.3881 7.3392 19.0886 109.9216 2.8679 257.2305 3.2441 0.3762 3.4177 44.5050 23.4519 9.1551 10.3979 66.5384 1.3445 44.6947 2.3852 0.9594 49.3670 100.9818 177.4428 6.2017 46.0351 111.4667 16.9364 5.2233 16.8664 25.0580 158.1185 194.1449 806.4960 404.0147 43.8004 28.3011 0.8991 25.7186 128.6980 25.3366 47.5582
temp: 298.150 k
press: 1.00000 atm
elementType: 8 8 7 7 7 6 6 6 6 6 1 1 1 1 1 1 1
symmnumber: 1
zpe: 334092.3 jmol-1
zpe.correction: 0.127249 hartree
zpe.thermalcorrener: 0.136852 hartree
zpe.thermalcorrenthalpy: 0.137796 hartree
zpe.thermalcorrgfe: 0.093045 hartree
zpe.sumelectzpe: -508.713495 hartree
zpe.sumelectthermal: -508.703892 hartree
zpe.sumelectthermalent: -508.702948 hartree
zpe.sumelectthermalfe: -508.747698 hartree
dipole: -3.1139 -0.2755 0.0099
dipole: 3.1261
quadrupole: -34.2578 -72.2370 -60.3479
quadrupole: -12.3719 -0.0318 0.0077
quadrupole: 21.3565 -16.6228 -4.7337 -12.3719 -0.0318 0.0077
hfenergy: -508.8407436 hartree
pointgroup: C01 [X(C5H7N3O2)]
dipole: -1.2298859 -0.0005345 -0.0085038 debye
dipolederiv: -0.3540519 0.5055289 0.048965 0.4158979 -1.2125429 -0.0711457 0.0405261 -0.0701845 -0.4310068 -0.6217778 -0.272287 -0.0281835 -0.380739 -1.2660315 -0.0874099 -0.0386553 -0.0864067 -0.3930017 -0.927005 -0.2827056 -0.0331081 -0.2143557 -0.5718847 -0.0303043 -0.0270247 -0.0306144 -0.2803143 -1.5158816 0.1061471 -0.0019779 0.6903158 -0.6491202 -0.0277694 0.0548959 -0.033939 -0.2874489 -1.65775 0.0433284 -0.0057943 0.1046948 -0.2131012 0.0535832 -0.0029241 0.053082 -0.7428866 -0.1353558 -0.034046 -0.0023782 -0.288695 -1.0579733 -0.0861169 -0.0271114 -0.0837514 -0.1906524 0.9720957 0.2127713 0.027925 0.5022111 1.5878088 0.1371478 0.055554 0.1342622 0.2084546 1.4044075 -0.1276492 -0.0004063 -0.2580487 1.5334283 0.1268259 -0.0128406 0.1283757 0.1915726 2.0319194 -0.0659501 0.0107323 -0.5533911 0.9228765 0.0550123 -0.0354971 0.0598725 0.2835112 -0.0419457 -0.0404751 -0.0059511 -0.0026864 -0.0287802 -0.0159849 -0.0023216 -0.0164729 0.1337102 0.1302585 -0.0162745 -0.0036689 0.0272413 0.1479486 -0.0178236 0.0006041 -0.0182408 0.3375411 -0.0215807 0.0344545 -0.0350617 0.1018111 0.022635 0.1230497 -0.0833527 0.0953273 -0.0369222 0.1220714 0.0000558 -0.0001024 -0.1449434 0.012869 -0.0130662 -0.013999 -0.0113115 0.1269749 -0.0248174 0.0290146 0.0422355 0.0862224 0.0617765 -0.1015635 0.1025207 -0.0754784 -0.0728076 0.250483 -0.0130743 -0.0025249 -0.0530668 0.1426237 -0.0261329 -0.0044381 -0.0260994 0.4005723 0.2686117 0.0350353 0.002452 0.0712332 0.1890581 -0.0197151 0.0063094 -0.0198835 0.3993998 0.1203188 -0.1138741 -0.0131527 -0.1037014 0.3784095 0.0014134 -0.0122456 0.0014628 0.3533039 unknown
polarizability: 115.310491|-0.464688|96.4550969|0.710438|5.4119049|40.066109 unknown
InChI: InChI=1S/C5H7N3O2/c1-2-3(9)7-5(6)8-4(2)10/h7,10H,6H2,1H3
charge 0 multiplicity 1
17 atoms
O  0.855265 -2.427064 -0.224349
O  1.076007 2.417296 0.238948
N  -0.933581 1.231122 0.105808
N  -1.050052 -1.140578 -0.120142
N  -3.023906 0.102418 -0.021222
C  1.147696 -0.013148 0.009519
C  0.511107 1.284256 0.125753
C  0.324259 -1.143842 -0.106909
C  -1.647278 0.051664 -0.012511
C  2.658423 -0.084377 0.019217
H  -1.392968 2.143011 0.187229
H  3.051286 -0.677829 0.869561
H  3.055188 0.939056 0.123639
H  3.071331 -0.503078 -0.920902
H  -3.550245 0.967168 0.060238
H  -3.513687 -0.784977 -0.110515
H  1.845856 -2.386398 -0.210562
