program: Gaussian 09
title: 000081098
version: EM64L-G09RevD.01
frameworkgroup: C1[X(C6H8N2O)]
method: RPBEPBE
basis: SDD
operation: Freq
keyword: #pfreq=noraman
keyword: PBEPBE/SDD
title: #p freq=noraman PBEPBE/SDD
converged: NO YES NO NO
title: Mulliken charges:
elementType: O N N C C C C C C H H H H H H H H
charge: -0.228929 -0.403065 0.002176 0.410236 0.137468 -0.419788 -0.788286 -0.772780 0.003024 0.318203 0.251957 0.240240 0.258341 0.240292 0.287501 0.235054 0.228357
chargesum: 0.00000
title: Mulliken charges with hydrogens summed into heavy atoms:
elementType: O N N C C C C C C
charge: -0.228929 -0.084862 0.002176 0.410236 0.137468 -0.167831 -0.049413 -0.021868 0.003024
polarizability: 8.90594443e+01 -4.22802096e+00 1.08935599e+02 -7.11149620e-02 -5.07356451e-02 4.42468645e+01
1716.lowfreq: -12.0598 -8.2265 -0.0006 0.0010 0.0011 4.5087 65.4485 105.2284 132.3884
frequency: 65.3884 105.2126 132.3791 169.6288 216.6659 266.0652 322.7214 488.8024 499.7331 542.6339 552.9721 590.6098 601.0353 613.5581 747.8295 849.8127 876.1677 925.8805 958.4882 1020.5037 1045.5602 1052.6599 1063.9374 1134.4509 1211.5709 1271.4841 1350.9667 1389.9754 1404.9331 1412.4871 1456.5929 1467.3393 1470.5483 1472.2922 1569.1379 1608.8615 1657.1700 2978.0410 2984.7715 3054.0432 3063.9237 3114.2188 3139.4412 3181.2147 3537.2473
redmass: 1.0525 1.7508 1.8545 2.8898 3.6892 2.5179 3.7848 6.5502 4.3927 3.6081 5.3716 5.6918 3.9608 1.1582 3.6582 4.1482 1.4722 2.2899 4.4549 1.5186 1.5577 1.5371 2.3682 5.4525 1.6679 2.5104 2.0603 1.3034 1.2868 2.5480 1.1041 1.0434 1.0475 1.2018 5.2144 6.5268 6.3175 1.0391 1.0394 1.0980 1.0980 1.0969 1.0967 1.0935 1.0783
irintensity: 0.0966 0.0010 0.0000 0.4066 1.9878 1.0189 3.3985 0.3399 1.5913 5.8431 0.7076 0.0174 0.1567 93.0572 0.0349 18.3564 31.2370 4.5293 5.7675 3.1680 1.8529 12.0223 3.5024 13.0202 6.4682 39.2237 18.0787 67.3422 15.9888 129.0605 26.2542 17.6318 21.5622 9.3120 353.0713 39.6173 278.1236 21.8626 16.6902 15.3740 17.4414 9.7973 2.5203 3.6332 37.6649
temp: 298.150 k
press: 1.00000 atm
elementType: 8 7 7 6 6 6 6 6 6 1 1 1 1 1 1 1 1
symmnumber: 1
zpe: 350738.9 jmol-1
zpe.correction: 0.133589 hartree
zpe.thermalcorrener: 0.142491 hartree
zpe.thermalcorrenthalpy: 0.143435 hartree
zpe.thermalcorrgfe: 0.099487 hartree
zpe.sumelectzpe: -417.501614 hartree
zpe.sumelectthermal: -417.492713 hartree
zpe.sumelectthermalent: -417.491769 hartree
zpe.sumelectthermalfe: -417.535716 hartree
dipole: 3.8848 -8.0644 0.0112
dipole: 8.9514
quadrupole: -49.1118 -58.9654 -53.8013
quadrupole: 6.5744 -0.0250 -0.0193
quadrupole: 4.8477 -5.0059 0.1582 6.5744 -0.0250 -0.0193
hfenergy: -417.6352036 hartree
pointgroup: C01 [X(C6H8N2O1)]
dipole: -2.0226316 2.8829678 0.0088692 debye
dipolederiv: -0.5844332 0.2881822 0.0002532 0.2895624 -1.171286 -0.0007451 0.0003423 -0.0001221 -0.3849248 -1.0058187 -0.2063932 0.0001438 0.0106967 -0.7750844 0.0009299 0.0006489 -0.0011183 -0.2146556 -0.4378411 -0.2015491 0.0008498 0.0275966 -1.1889751 -0.0024543 -0.0002883 0.0010376 -0.2634113 0.5561228 0.1499342 -0.0009977 -0.0642205 0.8455185 -0.0011557 -0.0014759 -0.0024934 0.0023839 0.9885408 -0.0890763 0.0002182 -0.095212 0.9490101 0.0068986 0.0057284 0.0150784 0.0624016 -0.5438274 0.453819 0.0001686 0.2068983 -0.3788431 -0.0002469 0.0003536 -0.0002454 -0.1851678 -0.1663999 -0.0203756 0.0001809 0.0816471 0.0036221 0.0001428 0.0000835 0.0003644 0.0806621 -0.114933 -0.0909367 0.0053219 -0.178506 -0.2115538 -0.0078398 -0.0068178 -0.0263319 0.0556521 0.8936135 -0.2973973 -0.0005697 -0.2478696 1.5995524 0.001137 -0.0009433 -0.0014272 0.2449082 0.1814638 0.0299652 0.0004491 0.0159156 0.1643127 0.000148 -0.0001114 0.0015666 0.3128921 -0.0178891 -0.079054 0.0002416 -0.0804619 0.0425628 0.000162 0.0003997 0.0003774 0.1629178 0.0406084 0.0291011 0.0041404 0.0630494 0.0270528 -0.1095529 0.0601297 -0.1143118 -0.0310114 0.0383487 -0.0330847 0.0002244 -0.1360317 -0.0358259 0.0002651 0.0002677 0.0001032 0.1255185 0.0405086 0.029431 -0.0043883 0.0632775 0.0273566 0.1093196 -0.0603137 0.1140886 -0.0310473 -0.0212039 0.0057876 0.0104732 0.087173 0.1012524 -0.0057914 0.0133538 0.0020876 0.132215 0.083478 0.0044507 0.0608445 -0.0279324 0.0090138 -0.0824698 0.021833 -0.11307 -0.0464084 0.0696615 0.0271959 -0.0775539 -0.0155826 -0.0076857 0.0912528 -0.0331902 0.1244162 -0.0229246 unknown
polarizability: 90.9350301|-7.1858677|107.0598487|0.0246742|0.1356839|44.2470287 unknown
InChI: InChI=1S/C6H8N2O/c1-4-3-6(9)8-5(2)7-4/h3,7H,1-2H3
charge 0 multiplicity 1
17 atoms
O  1.031298 -2.556748 -0.002852
N  -0.479167 1.225054 -0.001104
N  1.420526 -0.233529 -0.004683
C  -1.400755 0.16649 0.00074
C  0.902694 0.980304 -0.002914
C  -0.902907 -1.117253 -0.000045
C  -2.862179 0.539788 0.002631
C  1.793803 2.201574 0.003298
C  0.548611 -1.387113 -0.002687
H  -0.81697 2.189472 -0.001114
H  -1.580126 -1.974892 0.0010
H  -3.125448 1.136847 0.896707
H  -3.487371 -0.36606 0.004189
H  -3.12805 1.135576 -0.891526
H  2.838431 1.868058 -0.064869
H  1.670671 2.784887 0.935402
H  1.575738 2.870544 -0.850373
