program: Gaussian 09
title: 000081110
version: EM64L-G09RevD.01
frameworkgroup: C1[X(C7H6ClNO3)]
method: RPBEPBE
basis: SDD
operation: Freq
keyword: #p
keyword: freq=noraman
keyword: PBEPBE/SDD
title: #p freq=noraman PBEPBE/SDD
converged: YES YES NO NO
title: Mulliken charges:
elementType: Cl O O O N C C C C C C C H H H H H H
charge: -0.020741 -0.279588 -0.200338 -0.196089 0.022311 0.281775 0.253882 -0.283486 -0.316356 -0.095204 -0.210870 -0.513028 0.284380 0.286574 0.269224 0.243709 0.214239 0.259606
chargesum: 0.00000
title: Mulliken charges with hydrogens summed into heavy atoms:
elementType: Cl O O O N C C C C C C C
charge: -0.020741 -0.279588 -0.200338 -0.196089 0.022311 0.281775 0.253882 0.000894 -0.029782 -0.095204 0.058354 0.204526
polarizability: 1.59787382e+02 -2.87373208e-01 1.17175903e+02 6.02253678e-01 -1.33775064e+00 4.73701018e+01
1716.lowfreq: -10.2229 -0.0787 0.0028 0.0030 0.0030 4.6835 39.9105 77.5490 115.2864
frequency: 39.7658 77.5454 115.2837 131.3724 145.5322 184.2622 240.3043 247.0240 289.0890 304.2495 377.4296 430.5575 471.7700 530.7349 560.7135 605.9517 657.4436 671.0356 734.4714 758.7290 824.3762 831.9844 875.3813 957.3660 963.7499 1057.1483 1081.3498 1104.8779 1144.2403 1150.4915 1201.3877 1226.9631 1240.4579 1349.4841 1367.8734 1403.3339 1428.1099 1452.8029 1454.9669 1478.5790 1561.9912 1590.3877 2979.9934 3091.3156 3141.1478 3171.5751 3178.3384 3189.4251
redmass: 7.9554 8.2003 3.3294 2.3559 1.3458 10.2389 7.6430 7.3388 8.9655 6.5269 7.0806 4.1217 6.1953 7.7808 5.9694 5.1111 5.8875 7.1771 4.1378 8.7668 2.6852 2.2404 1.5125 3.8447 1.6367 3.7165 2.1175 1.2280 1.5960 1.3155 4.7340 5.4378 1.4290 4.5142 8.0323 4.7866 1.4801 1.0887 1.9904 1.0538 7.7669 7.4623 1.0333 1.1004 1.1037 1.0888 1.0931 1.0978
irintensity: 1.0927 3.0942 4.8367 3.6242 0.8747 4.8197 0.5372 3.5422 1.2506 3.9138 1.7512 8.7093 7.3592 13.4717 7.8345 6.5852 12.6909 3.3172 6.0682 7.0988 68.8236 27.1821 22.6230 94.9595 23.1194 28.7362 17.9679 3.0156 13.3841 6.9781 183.1732 165.0432 28.3661 43.6539 29.9729 103.0738 16.4411 10.6392 77.9925 16.7201 107.2148 125.6750 63.7050 21.3653 15.1296 0.9795 0.3396 0.8186
temp: 298.150 k
press: 1.00000 atm
elementType: 17 8 8 8 7 6 6 6 6 6 6 6 1 1 1 1 1 1
symmnumber: 1
zpe: 317443.2 jmol-1
zpe.correction: 0.120908 hartree
zpe.thermalcorrener: 0.132192 hartree
zpe.thermalcorrenthalpy: 0.133136 hartree
zpe.thermalcorrgfe: 0.082530 hartree
zpe.sumelectzpe: -1009.838175 hartree
zpe.sumelectthermal: -1009.826891 hartree
zpe.sumelectthermalent: -1009.825947 hartree
zpe.sumelectthermalfe: -1009.876553 hartree
dipole: 2.8743 1.4623 1.6527
dipole: 3.6237
quadrupole: -90.1409 -67.1725 -77.3426
quadrupole: -8.0436 -2.0700 0.5375
quadrupole: -11.9223 11.0462 0.8761 -8.0436 -2.0700 0.5375
hfenergy: -1009.9590825 hartree
pointgroup: C01 [X(C7H6Cl1N1O3)]
dipole: 1.1592672 -0.5699051 -0.6032243 debye
dipolederiv: -0.9185226 0.0919537 -0.0451767 0.1462585 -0.1279884 0.0168693 -0.0433055 0.0153518 -0.0503817 -0.6855514 -0.5435962 -0.1091471 -0.5019399 -1.1457244 -0.1674615 -0.0263866 -0.0173183 -0.3860615 -0.6004488 0.2212239 0.0112773 0.2547092 -0.7671407 -0.1741711 -0.0148509 -0.1447569 -0.2852915 -0.7551781 -0.1440812 -0.1389966 -0.1644954 -0.5218248 -0.1708298 -0.0937102 -0.2092716 -0.2883824 1.6842629 -0.2786357 0.1732266 -0.2125752 1.0607445 0.3932474 0.1352344 0.3400761 0.3422893 0.8017482 0.5543994 0.0133995 0.0993015 0.9217578 -0.0417894 -0.1574917 -0.2229323 0.0223569 -0.6988039 0.2211105 -0.0690587 0.0349771 -0.2064431 -0.0448667 -0.0414967 0.0076797 0.0147218 -0.6872269 -0.2766092 -0.0042639 -0.0854414 -0.1193139 -0.0332261 0.0098369 -0.0272502 -0.0950981 0.3263236 -0.1572145 0.0140059 0.225024 -0.0475992 -0.0097744 0.0608326 -0.0296719 -0.073637 1.4234046 -0.1198353 0.0611234 -0.2271785 0.3810299 -0.0575414 0.0589558 -0.0757086 -0.0284066 -0.4549524 0.2475431 -0.0369929 0.2649899 -0.1680108 0.0026838 -0.0320331 0.0171088 -0.1184789 0.3563677 0.179903 0.0835558 0.2080945 0.5911517 0.1884786 0.1951843 0.3758514 0.4163965 0.0877856 0.0237846 -0.0006927 0.0274025 0.0225998 0.0255499 0.0130283 0.0321123 0.1613343 0.0903837 0.0479608 -0.0081323 0.0050273 0.0543835 0.0221139 -0.0243626 0.007735 0.1651614 0.036806 -0.0561695 0.0048978 -0.0519895 0.0437987 0.0168476 -0.0020208 0.0221759 0.167819 0.0412243 -0.113913 0.0299021 -0.1090576 -0.0450068 0.0234874 0.0446761 0.0546287 0.0523218 -0.0767734 0.1062644 0.1056346 0.0167125 0.0032416 -0.0768353 0.0124762 -0.1299042 -0.004201 0.0291506 -0.0040888 -0.084562 0.0701804 0.0703446 0.0872177 -0.0945665 -0.0159058 -0.0124624 unknown
polarizability: 159.4080906|-0.6898637|117.1646538|6.4932232|1.6949801|47.7606427 unknown
InChI: InChI=1S/C7H6ClNO3/c1-12-7-4-5(8)2-3-6(7)9(10)11/h2-4H,1H3
charge 0 multiplicity 1
18 atoms
Cl 4.024892 -0.236182 0.157672
O  -0.908414 -1.809163 0.440801
O  -2.295135 2.116554 0.226928
O  -2.755107 0.037382 -0.588157
N  -1.938429 0.927441 -0.134044
C  -0.05015 -0.747014 0.157926
C  -0.503075 0.590891 -0.046568
C  1.346126 -0.979133 0.223866
C  0.414882 1.661489 -0.156162
C  2.241771 0.093764 0.079584
C  1.799173 1.421245 -0.108024
C  -1.345876 -2.649236 -0.701462
H  1.699141 -1.995666 0.416887
H  0.024289 2.675254 -0.279437
H  2.514946 2.240946 -0.206709
H  -1.947416 -3.449987 -0.24826
H  -0.467905 -3.078737 -1.220946
H  -1.962612 -2.050348 -1.391397
