program: Gaussian 09
title: 000081106
version: EM64L-G09RevD.01
frameworkgroup: C1[X(C12H11Cl)]
method: RPBEPBE
basis: SDD
operation: Freq
keyword: #p
keyword: freq=noraman
keyword: PBEPBE/SDD
title: #p freq=noraman PBEPBE/SDD
converged: YES YES NO NO
title: Mulliken charges:
elementType: Cl C C C C C C C C C C C C H H H H H H H H H H H
charge: -0.100713 0.218316 0.290333 0.427362 0.334171 -0.455234 -0.437950 -0.371608 -0.834923 -0.430452 -0.840554 -0.257072 -0.243477 0.238647 0.233705 0.246666 0.274916 0.288442 0.240228 0.252397 0.235521 0.232312 0.228719 0.230249
chargesum: 0.00000
title: Mulliken charges with hydrogens summed into heavy atoms:
elementType: Cl C C C C C C C C C C C C
charge: -0.100713 0.218316 0.290333 0.427362 0.334171 -0.216587 -0.204245 -0.124943 -0.271565 -0.190224 -0.120324 -0.028354 -0.013228
polarizability: 1.88815272e+02 1.28293646e+01 1.64286823e+02 5.09854227e+00 -5.90094937e+00 7.31193867e+01
1716.lowfreq: -8.5214 -0.0035 -0.0031 -0.0009 8.8820 11.4846 42.9985 75.5129 112.5441
frequency: 42.9650 75.5055 112.5362 157.0658 171.1148 230.1847 286.7232 316.5732 352.6857 413.8027 427.9744 465.1089 503.1150 512.1725 517.2369 575.2712 604.7548 677.0829 694.4718 720.3111 754.8737 799.4411 829.8912 844.1702 859.7922 885.1773 955.3960 956.5539 977.4050 992.3338 1011.8847 1037.0961 1044.5477 1078.1467 1137.1724 1159.5557 1177.4203 1199.0738 1237.9753 1242.1377 1251.3469 1281.1779 1362.4171 1398.7213 1409.6439 1414.4666 1431.6531 1459.5652 1472.0792 1476.4900 1496.9645 1520.9881 1578.8356 1602.4408 1633.1405 2974.8245 3054.4583 3086.1070 3088.7559 3120.3086 3122.6779 3135.0337 3145.2962 3152.7745 3161.9835 3167.5490
redmass: 7.5814 5.1543 3.7648 3.5201 1.1253 4.2322 3.4382 4.1523 2.4575 3.3563 4.8624 3.4958 3.9677 3.2311 5.3560 6.0378 3.6737 5.0011 4.2544 4.6676 1.3035 2.5522 1.3327 2.4761 3.8566 1.8448 1.7991 1.3480 1.3900 1.3499 1.8516 2.0482 1.5689 2.6597 1.2032 1.2894 1.1530 1.6421 1.6473 1.3428 2.3295 1.7303 2.7898 1.2708 3.3670 3.1435 3.7999 1.5429 1.6679 1.0534 1.0947 3.2944 7.1484 6.0214 6.6475 1.0391 1.0957 1.0627 1.0940 1.0868 1.0865 1.0887 1.0976 1.0949 1.1089 1.1000
irintensity: 1.5603 0.8052 2.2127 1.9245 1.2200 2.0927 0.4216 3.0449 0.6549 1.6063 0.4282 9.2153 19.6194 0.1755 35.1220 35.1441 13.9418 7.9899 1.2575 4.0009 36.4956 20.2746 58.1469 0.3757 5.5080 6.6267 5.8201 0.8725 3.3742 0.5558 1.8771 5.3851 9.5228 2.3060 3.1818 3.3835 3.5730 17.8654 20.6108 21.1596 4.9043 1.3861 0.2629 17.6912 0.5648 4.2678 6.7208 14.7542 5.0572 18.9866 4.6861 22.4663 2.0275 9.9380 6.7147 27.6765 15.4171 13.5774 21.8144 3.5520 3.2476 6.9645 31.1317 32.1414 0.1440 26.3192
temp: 298.150 k
press: 1.00000 atm
elementType: 17 6 6 6 6 6 6 6 6 6 6 6 6 1 1 1 1 1 1 1 1 1 1 1
symmnumber: 1
zpe: 502649.3 jmol-1
zpe.correction: 0.191449 hartree
zpe.thermalcorrener: 0.202648 hartree
zpe.thermalcorrenthalpy: 0.203592 hartree
zpe.thermalcorrgfe: 0.153639 hartree
zpe.sumelectzpe: -923.040702 hartree
zpe.sumelectthermal: -923.029503 hartree
zpe.sumelectthermalent: -923.028559 hartree
zpe.sumelectthermalfe: -923.078512 hartree
dipole: -1.0055 1.8960 1.4892
dipole: 2.6122
quadrupole: -76.8841 -77.1816 -86.7707
quadrupole: 5.9212 5.4548 -4.6141
quadrupole: 3.3947 3.0972 -6.4919 5.9212 5.4548 -4.6141
hfenergy: -923.2321508 hartree
pointgroup: C01 [X(C12H11Cl1)]
dipole: 0.1770305 0.7773985 -0.648469 debye
dipolederiv: -0.3081444 -0.1877444 0.0519809 -0.2854872 -0.6301268 0.1372282 0.2750543 0.4432938 -0.3913995 0.1830464 0.0041256 -0.0110677 -0.1564765 -0.1189391 -0.009399 0.0134527 -0.0124363 0.0203589 -0.1737202 -0.0415099 -0.0024775 -0.0474687 -0.2523016 0.0377682 -0.0837748 -0.1508613 -0.1591453 -0.0191867 -0.0297422 -0.0200453 -0.0204796 -0.166298 -0.0198177 -0.0216917 -0.0365187 0.0519215 0.3842324 -0.0808551 0.050352 0.1672316 0.0421918 0.0099742 0.074099 0.0174032 -0.0052434 0.1193833 0.0348916 0.0234606 -0.071449 0.1076633 0.0507988 0.0038936 0.0465823 -0.1440946 -0.3150706 -0.0928506 -0.0080175 -0.1599869 0.0898585 0.0284781 -0.0446198 0.0264803 -0.1632212 -0.1319797 0.0183572 0.0012794 0.0714251 0.0878467 0.017874 -0.0291039 0.0051744 -0.1579166 0.2970228 0.3001824 -0.0966855 0.4256365 0.8011212 -0.2393532 -0.2302915 -0.3987794 0.4774559 0.0571241 0.0029049 0.0173495 0.0980802 0.1020869 0.0413764 0.0343034 0.0419933 -0.165782 -0.192994 -0.0037029 -0.0069814 -0.0790555 0.082406 0.013436 -0.0597745 0.0511231 0.047769 -0.0426841 -0.0310802 0.0095274 -0.0487068 0.1631804 0.028966 0.0195034 0.0250205 -0.1496989 0.0875332 0.072143 0.030252 0.0792229 -0.1239806 0.0105523 0.0306372 0.0146078 -0.1593344 0.0282236 -0.108838 -0.0229175 -0.0486015 -0.0572394 -0.0343469 -0.0113462 -0.0385032 0.1428719 0.0028411 0.1235559 0.0109363 0.0865989 -0.0558649 -0.0232139 0.0111526 -0.0297789 0.1480901 0.0625149 -0.0901872 -0.0240082 -0.0479065 -0.0486762 -0.0262681 -0.0037705 -0.015407 0.1383121 0.0611929 0.0851353 0.1063974 -0.0112782 -0.0420385 -0.0085533 0.0828851 0.0314677 -0.0278747 -0.061912 -0.0523589 -0.0598787 0.013402 0.0568651 0.0848439 -0.0184855 0.0827439 -0.0062134 0.0428795 -0.0347221 -0.0127245 -0.1071066 -0.0746826 -0.0390738 -0.0234219 -0.0380148 0.1487575 0.0091968 -0.0159758 0.0191984 -0.0785537 0.0115796 0.0913026 0.0708853 0.0640321 0.0374405 0.0565375 0.0250802 0.0066598 0.134176 -0.1026637 -0.0584691 0.0427962 -0.0693844 0.0941903 -0.0119333 0.0176858 -0.043553 -0.0186935 0.0967809 -0.0660608 -0.1047525 -0.0346554 -0.0923161 0.0096621 0.0961191 0.0030883 0.1114948 -0.060716 -0.0191417 -0.0016498 -0.0168291 0.1554312 -0.1437656 -0.0106135 -0.0221251 -0.0060177 0.0919472 -0.0089012 -0.0259803 -0.0087538 0.1596414 unknown
polarizability: 193.6980038|-4.6171239|160.0550488|1.8808811|0.5958619|72.468429 unknown
InChI: InChI=1S/C12H11Cl/c1-9-6-7-10-4-2-3-5-11(10)12(9)8-13/h2-7H,8H2,1H3
charge 0 multiplicity 1
24 atoms
Cl -2.104224 -2.683905 0.95752
C  0.398727 -0.309283 -0.164602
C  -1.043892 -0.346885 -0.299938
C  1.054571 0.959493 0.077252
C  -1.806744 0.832069 -0.135452
C  0.255257 2.140122 0.207348
C  -1.133557 2.071915 0.115867
C  1.218835 -1.485539 -0.243084
C  -1.733243 -1.631947 -0.628386
C  2.482736 1.012716 0.193824
C  -3.325062 0.825901 -0.210445
C  2.608524 -1.406494 -0.120487
C  3.251581 -0.146943 0.091542
H  0.752179 3.099991 0.392289
H  -1.73536 2.980117 0.234683
H  0.752535 -2.467041 -0.370743
H  -1.137539 -2.314519 -1.248004
H  -2.728802 -1.493193 -1.066338
H  2.960153 1.98398 0.370665
H  -3.760788 0.05113 0.44648
H  -3.733858 1.801515 0.10121
H  -3.689341 0.631289 -1.237933
H  3.213612 -2.31809 -0.176826
H  4.342099 -0.101401 0.182457
