program: Gaussian 09
title: 000000495
version: EM64L-G09RevD.01
frameworkgroup: C1[X(C9H17NO6S)]
method: RPBEPBE
basis: SDD
operation: Freq
keyword: #p
keyword: freq=noraman
keyword: PBEPBE/SDD
title: #p freq=noraman PBEPBE/SDD
converged: NO YES NO NO
title: Mulliken charges:
elementType: S O O O O O O N C C C C C C C C C H H H H H H H H H H H H H H H H H
charge: 0.110698 -0.235417 -0.523619 -0.436434 -0.420091 -0.465116 -0.212589 -0.561223 0.013266 -0.202545 -0.202402 -0.104949 -0.688466 -0.639839 -0.407473 -0.161721 0.173702 0.239780 0.257680 0.269733 0.264380 0.265676 0.293118 0.416629 0.346327 0.275616 0.257170 0.226013 0.262613 0.366286 0.266040 0.281113 0.284836 0.391208
chargesum: 0.00000
title: Mulliken charges with hydrogens summed into heavy atoms:
elementType: S O O O O O O N C C C C C C C C C
charge: 0.110698 -0.235417 -0.106990 -0.090108 -0.053805 -0.073907 -0.212589 0.004725 0.253047 0.055135 0.067331 0.159432 -0.129672 -0.107053 0.081153 0.104318 0.173702
polarizability: 1.83342076e+02 -4.75001357e+00 1.23162115e+02 5.30029668e-01 5.19589808e+00 1.19385413e+02
1716.lowfreq: -20.7662 -12.5114 -10.2992 -0.0021 -0.0014 0.0012 4.1611 20.3440 34.9179
frequency: -11.6944 19.0133 34.3940 60.8741 81.9982 84.2919 107.4730 114.7662 142.9492 156.2957 197.3327 230.2582 234.0867 240.2803 248.4886 271.1864 279.0420 305.6822 323.3199 343.7572 367.4227 420.0532 440.7069 498.5425 515.3990 567.7063 579.6602 592.7098 612.6872 626.4234 643.6086 665.3257 698.0767 714.4591 717.2825 733.1390 751.2605 805.5385 834.6142 847.5809 895.5833 904.3880 935.1240 958.6547 968.2710 1000.5786 1007.2276 1018.2493 1025.7872 1037.0953 1057.1559 1107.8815 1122.0722 1141.5251 1143.6773 1152.2657 1167.0686 1179.9302 1224.7748 1226.5993 1230.5205 1249.0709 1251.0450 1282.0430 1282.6454 1293.2490 1302.7451 1313.5773 1331.0048 1335.9936 1350.4150 1365.0465 1382.3935 1416.5811 1445.0489 1453.1940 1456.2313 1647.7052 1665.7148 2987.4333 3009.8162 3015.3148 3031.3226 3036.5283 3043.6007 3053.8231 3068.7567 3089.7965 3116.3979 3131.5118 3390.5166 3413.3377 3455.3913 3488.4981 3573.5838 3582.1647
redmass: 5.2879 6.2746 9.0457 7.5977 5.5329 6.7388 7.1636 4.4283 6.0638 3.6903 4.1283 3.0568 1.6937 3.1259 1.6616 3.1613 2.3063 2.0369 3.2038 5.0024 5.7369 4.5692 4.7030 3.5813 4.2554 2.1066 1.5677 2.7892 1.3571 2.0687 2.0362 1.3583 5.6712 3.6916 2.9808 2.6483 5.4690 3.8242 4.0058 1.9546 2.3687 1.9434 1.9350 4.7087 2.6173 2.0952 3.8012 3.1680 2.7225 2.0396 2.2775 1.7274 1.9176 1.5766 1.4408 1.2613 1.8291 1.1093 1.3343 1.4898 1.2280 1.3754 1.2789 1.1837 1.2893 1.3447 1.3243 1.2961 1.3955 1.5160 1.4692 1.4232 1.4871 1.2497 1.0931 1.0850 1.0880 1.0916 8.1074 1.0632 1.0847 1.0593 1.0859 1.0585 1.0883 1.0873 1.0969 1.1063 1.1080 1.0903 1.0658 1.0676 1.0451 1.0638 1.0667 1.0977
irintensity: 0.8595 3.6995 5.6302 0.2779 1.5402 2.0464 5.2609 1.6423 4.3246 1.6558 4.5430 13.0646 8.5187 35.5095 109.7829 43.8822 9.1097 29.8611 4.6439 7.2009 4.4569 10.5053 6.9401 4.7046 11.5373 5.4217 8.4756 24.4438 58.4223 55.0284 207.1528 273.3901 5.5999 6.8887 81.8827 7.3313 49.6556 38.1602 62.3452 16.5253 7.3340 23.9752 26.2326 210.8636 229.2489 58.6289 50.1490 35.2642 124.6619 24.2104 7.0154 6.7689 29.8787 2.8150 7.0152 7.1352 10.0635 37.7074 22.5541 0.3759 4.1185 17.3936 34.6747 17.0455 16.6096 11.1441 0.6107 1.5131 2.4974 25.1499 17.7811 5.7823 4.1839 86.5427 13.0100 16.1942 12.3305 50.1408 225.1972 16.9479 8.4234 23.3856 32.6208 21.2848 24.6413 2.6051 15.0134 19.7384 8.6970 27.4933 175.3898 232.7173 2.6068 20.4050 7.9346 5.6878
temp: 298.150 k
press: 1.00000 atm
elementType: 16 8 8 8 8 8 8 7 6 6 6 6 6 6 6 6 6 1 1 1 1 1 1 1 1 1 1 1 1 1 1 1 1 1
symmnumber: 1
zpe: 705339.8 jmol-1
zpe.correction: 0.268650 hartree
zpe.thermalcorrener: 0.286916 hartree
zpe.thermalcorrenthalpy: 0.287860 hartree
zpe.thermalcorrgfe: 0.221348 hartree
zpe.sumelectzpe: -1255.916912 hartree
zpe.sumelectthermal: -1255.898646 hartree
zpe.sumelectthermalent: -1255.897702 hartree
zpe.sumelectthermalfe: -1255.964214 hartree
dipole: -4.1951 -0.6450 3.1948
dipole: 5.3123
quadrupole: -123.5899 -112.5776 -104.2548
quadrupole: -1.2046 11.6210 -8.8999
quadrupole: -10.1158 0.8965 9.2193 -1.2046 11.6210 -8.8999
hfenergy: -1256.1855617 hartree
pointgroup: C01 [X(C9H17N1O6S1)]
dipole: -1.6530145 0.0425937 1.2782735 debye
polarizability: 182.8995704|-6.8031717|125.3331934|1.6968185|4.1026327|117.6568412 unknown
InChI: InChI=1S/C9H17NO6S/c10-4(8(13)14)1-2-17-3-5-6(11)7(12)9(15)16-5/h4-7,9,11-13,15H,1-3,10H2
charge 0 multiplicity 1
34 atoms
S  -0.578875 1.993456 -0.130186
O  3.18251 0.53011 -1.075526
O  1.003725 -1.047884 0.535217
O  4.205373 0.413537 1.699987
O  3.187288 -1.899573 -0.993295
O  -1.741927 -1.513623 0.231412
O  -3.941811 -1.820256 -0.441045
N  -4.596478 0.386543 1.423747
C  2.083799 1.094615 -0.235431
C  1.873708 0.073002 0.917996
C  3.290777 -0.537691 1.062901
C  3.714853 -0.687773 -0.417548
C  0.87784 1.315152 -1.14979
C  -2.016774 1.460242 -1.256188
C  -3.323098 1.369556 -0.450871
C  -3.327994 0.312367 0.690868
C  -3.085658 -1.088705 0.09686
H  2.447663 2.049986 0.189639
H  1.511163 0.558762 1.842452
H  3.264405 -1.514075 1.579984
H  4.799839 -0.698433 -0.582658
H  0.567794 0.357153 -1.598941
H  1.127459 2.033426 -1.945364
H  0.040152 -0.785916 0.530372
H  4.063647 0.394908 2.679327
H  -2.115007 2.207084 -2.060785
H  -1.739682 0.489393 -1.703734
H  -4.152156 1.141745 -1.151343
H  -3.556951 2.338916 0.025041
H  2.22497 -1.956735 -0.72349
H  -2.496054 0.541142 1.377772
H  -4.59071 -0.083342 2.334063
H  -5.412584 0.122897 0.860402
H  -1.637108 -2.430786 -0.145645
