program: Gaussian 09
title: 000081103
version: EM64L-G09RevD.01
frameworkgroup: C1[X(C11H15NO)]
method: RPBEPBE
basis: SDD
operation: Freq
keyword: #p
keyword: freq=noraman
keyword: PBEPBE/SDD
title: #p freq=noraman PBEPBE/SDD
converged: YES YES NO NO
title: Mulliken charges:
elementType: O N C C C C C C C C C C C H H H H H H H H H H H H H H H
charge: -0.244799 -0.451280 0.107829 -0.691316 -0.691696 -0.685040 0.180832 0.487279 -0.452773 -0.352074 -0.198735 -0.213170 -0.256721 0.193434 0.221483 0.235752 0.193099 0.235715 0.221592 0.231770 0.197000 0.231136 0.295857 0.216522 0.308694 0.225220 0.226091 0.228301
chargesum: 0.00000
title: Mulliken charges with hydrogens summed into heavy atoms:
elementType: O N C C C C C C C C C C C
charge: -0.244799 -0.155423 0.107829 -0.040647 -0.041290 -0.025134 0.180832 0.487279 -0.236251 -0.043380 0.026484 0.012921 -0.028421
polarizability: 1.86109173e+02 -2.93799893e+00 1.27777819e+02 2.75498257e-02 -2.37243111e-03 7.63172066e+01
1716.lowfreq: -14.7592 -0.0007 -0.0004 0.0002 2.5634 8.6897 28.3477 54.7420 73.0944
frequency: 24.0924 54.5337 73.0899 120.4874 172.3684 199.5996 221.7355 236.2843 239.2548 284.5823 304.1759 343.4156 353.7721 368.1542 407.6498 442.0293 512.5524 546.4449 600.0243 615.1717 648.6874 696.5410 719.6725 769.5652 787.8057 831.6011 840.9018 892.3275 916.0958 925.5136 938.4351 946.3351 971.6224 984.2503 999.9934 1017.7920 1021.8046 1027.4672 1086.6138 1140.5585 1171.4338 1185.4457 1208.9970 1224.1224 1257.2894 1260.3431 1315.1993 1377.2885 1380.6043 1383.2541 1406.7872 1426.1793 1452.9979 1459.4549 1460.2832 1476.1328 1480.0344 1485.0425 1488.3299 1512.2793 1597.3481 1612.0020 1617.8414 2972.1564 2975.0535 2990.5798 3061.1504 3066.6515 3079.1939 3081.7060 3089.9864 3102.5987 3105.3685 3131.2774 3143.4970 3164.9800 3198.7314 3528.7648
redmass: 3.0198 4.3326 5.0854 3.8986 1.0996 2.0431 3.0519 1.1567 1.2630 2.9137 3.0175 3.0935 5.2947 2.3342 2.9237 2.8959 2.7681 4.1501 4.6212 6.4246 1.1698 1.9624 6.4791 1.7461 4.0629 4.2710 1.2731 3.9646 1.4352 1.6992 1.5842 1.2087 1.3504 6.1435 1.3075 1.4051 1.7032 1.7141 1.5491 3.0608 1.0523 1.1137 2.9796 2.9887 2.7402 2.2867 1.5006 1.2201 1.1797 5.0912 1.2258 2.3389 1.0484 1.0583 1.0505 1.0525 1.1982 1.8194 1.1424 1.9437 7.3285 4.1782 5.9048 1.0354 1.0355 1.0362 1.0988 1.0981 1.1007 1.1001 1.0992 1.0997 1.0888 1.0866 1.0933 1.0999 1.0948 1.0753
irintensity: 0.5079 2.5228 3.1702 0.9690 0.2498 1.6619 1.7629 1.0749 1.0156 1.0534 0.0871 1.1060 10.3523 0.0890 0.0426 2.2550 24.7716 3.5217 2.3047 0.6178 38.2558 52.0173 0.6602 95.8651 0.8132 0.1999 0.1441 30.2750 12.2450 2.8103 4.0538 0.9793 0.1751 0.1275 2.8455 0.3962 0.2888 8.9774 20.7714 80.3986 0.6549 4.5041 8.4110 7.8066 0.7103 36.1838 54.8130 32.6807 15.8501 49.6615 34.9920 76.0158 0.4338 0.3127 1.6349 11.2582 8.4831 106.8416 2.3566 345.4879 87.0252 52.1449 71.9651 25.0055 31.7003 28.1455 2.7197 100.1457 12.2746 11.4715 61.0057 28.8232 16.6106 0.5212 31.4617 25.7030 7.1219 7.8143
temp: 298.150 k
press: 1.00000 atm
elementType: 8 7 6 6 6 6 6 6 6 6 6 6 6 1 1 1 1 1 1 1 1 1 1 1 1 1 1 1
symmnumber: 1
zpe: 617353.2 jmol-1
zpe.correction: 0.235137 hartree
zpe.thermalcorrener: 0.248455 hartree
zpe.thermalcorrenthalpy: 0.249399 hartree
zpe.thermalcorrgfe: 0.194874 hartree
zpe.sumelectzpe: -557.188139 hartree
zpe.sumelectthermal: -557.174821 hartree
zpe.sumelectthermalent: -557.173877 hartree
zpe.sumelectthermalfe: -557.228403 hartree
dipole: -0.7061 -3.5629 0.0003
dipole: 3.6322
quadrupole: -69.0968 -77.3956 -82.0155
quadrupole: 3.7987 0.0029 0.0052
quadrupole: 7.0725 -1.2263 -5.8462 3.7987 0.0029 0.0052
hfenergy: -557.4232762 hartree
pointgroup: C01 [X(C11H15N1O1)]
dipole: -0.2552805 1.4060153 -0.0023215 debye
polarizability: 186.1882347|2.0015788|127.6985317|0.1242437|-0.0665061|76.3174322 unknown
InChI: InChI=1S/C11H15NO/c1-11(2,3)10(13)12-9-7-5-4-6-8-9/h4-8,12H,1-3H3
charge 0 multiplicity 1
28 atoms
O  -1.165974 -1.713606 -0.001203
N  -0.268432 0.447462 -0.002002
C  -2.743778 0.206627 -0.006629
C  -2.918118 1.072833 -1.289197
C  -2.919821 1.090718 1.263104
C  -3.808315 -0.915792 0.000797
C  -1.332242 -0.457833 -0.002614
C  1.133219 0.191197 -0.000317
C  1.999997 1.318935 -0.001069
C  1.686308 -1.118146 0.002011
C  3.397971 1.144426 0.000426
C  3.089511 -1.27473 0.003493
C  3.953997 -0.156474 0.002714
H  -2.224086 1.93423 -1.324632
H  -3.946638 1.476751 -1.326335
H  -2.754919 0.468476 -2.199508
H  -2.226526 1.953155 1.287435
H  -2.757853 0.499568 2.182258
H  -3.948506 1.494893 1.292922
H  -3.7013 -1.568567 -0.881816
H  -4.820181 -0.470181 -0.003859
H  -3.703523 -1.554502 0.893981
H  -0.524307 1.437456 -0.002979
H  1.577901 2.332841 -0.002877
H  1.016911 -1.979583 0.002648
H  4.05193 2.023537 -0.000238
H  3.508024 -2.287577 0.005315
H  5.040452 -0.293712 0.00387
