program: Gaussian 09
title: 000081093
version: EM64L-G09RevD.01
frameworkgroup: C1[X(C6H10BrN)]
method: RPBEPBE
basis: SDD
operation: Freq
keyword: #p
keyword: freq=noraman
keyword: PBEPBE/SDD
title: #p freq=noraman PBEPBE/SDD
converged: NO YES NO NO
title: Mulliken charges:
elementType: Br N C C C C C C H H H H H H H H H H
charge: -0.033606 -0.015376 -0.355171 -0.372008 -0.314673 -0.426512 -0.693829 -0.154548 0.199540 0.199730 0.225379 0.225326 0.230734 0.230662 0.248390 0.248494 0.278734 0.278733
chargesum: 0.00000
title: Mulliken charges with hydrogens summed into heavy atoms:
elementType: Br N C C C C C C
charge: -0.033606 -0.015376 0.044099 0.078697 0.146723 0.070373 -0.136362 -0.154548
polarizability: 1.25013419e+02 1.72311410e+00 6.94412116e+01 -1.07099184e-02 -9.48548444e-03 5.46997980e+01
1716.lowfreq: -0.0003 0.0003 0.0005 3.6041 8.4715 31.5293 57.7936 61.4835 67.4062
frequency: 55.0920 61.4791 67.3651 127.8167 138.9208 159.6733 182.1045 325.9310 373.8648 391.6071 529.6552 625.9167 733.5549 751.5442 810.4784 919.5553 923.5599 1004.9633 1031.4146 1041.9790 1060.6396 1077.6786 1121.2465 1212.5329 1220.9181 1253.9871 1270.0462 1295.7147 1298.2263 1302.7608 1340.3328 1355.9505 1449.1842 1452.0163 1468.7572 1473.3258 1487.2707 2195.1547 2963.6529 2986.9957 2999.4451 3003.7253 3010.8264 3037.0523 3047.1819 3059.7478 3073.2193 3132.0845
redmass: 2.9884 7.4655 2.6478 2.1814 2.1625 5.5701 8.5258 4.4124 3.5428 4.0669 5.9273 4.9576 1.0786 1.1154 1.2623 5.5161 1.3091 4.6499 4.0269 1.1646 2.9069 3.2548 1.2899 1.1697 1.4066 1.2494 1.1875 1.0607 1.1074 1.3260 1.3828 1.5192 1.0816 1.1019 1.0662 1.0902 1.0992 12.4326 1.0588 1.0588 1.0598 1.0592 1.1007 1.1010 1.0563 1.1043 1.1049 1.1112
irintensity: 1.3657 4.3827 0.9194 0.4901 1.2829 5.1582 0.9892 0.8021 0.5367 4.5814 10.1903 25.4001 12.4949 3.2025 2.1303 0.6004 0.6673 5.8467 3.8054 1.5011 1.8220 1.6940 0.3191 9.1475 0.5320 40.1830 0.2531 0.0120 1.1075 8.6333 12.0966 0.8645 7.6129 2.4098 0.2729 0.0859 22.4597 13.3559 23.2192 3.1764 1.3062 47.9162 10.5772 0.0219 24.6021 2.0913 66.5334 18.2257
temp: 298.150 k
press: 1.00000 atm
elementType: 35 7 6 6 6 6 6 6 1 1 1 1 1 1 1 1 1 1
symmnumber: 1
zpe: 388225.0 jmol-1
zpe.correction: 0.147867 hartree
zpe.thermalcorrener: 0.157773 hartree
zpe.thermalcorrenthalpy: 0.158717 hartree
zpe.thermalcorrgfe: 0.110237 hartree
zpe.sumelectzpe: -302.199890 hartree
zpe.sumelectthermal: -302.189984 hartree
zpe.sumelectthermalent: -302.189040 hartree
zpe.sumelectthermalfe: -302.237519 hartree
dipole: -1.2395 3.1491 0.0025
dipole: 3.3843
quadrupole: -99.4145 -58.0386 -57.1593
quadrupole: 10.5158 0.0165 -0.0033
quadrupole: -27.8770 13.4989 14.3782 10.5158 0.0165 -0.0033
hfenergy: -302.3477567 hartree
pointgroup: C01 [X(C6H10Br1N1)]
dipole: 0.5770149 -1.1998749 0.0136899 debye
dipolederiv: -0.6048782 -0.0947078 0.002021 -0.2244733 -0.2252948 0.0012629 0.0033486 0.000966 -0.1486507 -0.3461586 -0.0060883 0.0000267 0.0989123 -0.2291517 -0.0000764 -0.0009913 -0.0000389 -0.2350347 -0.1337152 -0.0175956 0.000858 0.1422022 0.1368052 0.0001089 -0.0006791 0.0008588 0.2018638 0.1238025 0.0261818 -0.0001279 0.0186117 0.0232308 0.0017075 -0.0000563 0.0014236 0.1661977 -0.1987694 0.0020848 0.000737 -0.1596347 -0.0177735 0.0019376 0.0022957 0.0011589 0.1306302 -0.1047074 0.0519855 -0.0002185 0.0759798 0.146629 0.001004 -0.0006407 0.0012534 0.2489858 0.7708166 0.2722995 -0.004191 0.297698 0.280286 -0.0022658 -0.0044861 -0.0021258 0.1298358 0.1212444 -0.1234642 0.0014348 -0.2402893 -0.007106 -0.0004845 0.0025727 -0.0006393 -0.0637542 0.0545714 0.0042579 0.0014848 -0.0023103 -0.0387963 -0.1124278 -0.0013558 -0.1363286 -0.0758871 0.0543449 0.0046172 -0.0020619 -0.0020178 -0.0338574 0.11159 0.0010081 0.1354397 -0.080758 0.0406722 -0.0120057 -0.0019966 -0.0013627 -0.0095982 -0.0983045 0.0058944 -0.1141961 -0.0542354 0.0407833 -0.011696 0.0019956 -0.0011885 -0.0054168 0.0973024 -0.0061528 0.1132312 -0.0583956 0.0629731 0.0041843 0.0171176 0.02402 -0.0076443 -0.0963894 0.0102408 -0.1072795 -0.0502623 0.0628489 0.0045717 -0.0178852 0.0245366 -0.0040971 0.0954379 -0.0113837 0.1064729 -0.0536708 0.0563638 0.0298552 0.0034229 0.007882 0.0278604 -0.0753034 -0.0097327 -0.1058587 -0.0076447 0.0562033 0.0297986 -0.0040825 0.0080767 0.0317701 0.074418 0.0095341 0.10491 -0.0114902 -0.028219 -0.0826649 -0.023925 -0.0334341 -0.0355941 -0.0915533 0.0239416 -0.0993513 -0.0171927 -0.0281765 -0.0816138 0.0253903 -0.0332088 -0.0322512 0.092036 -0.0233574 0.1001038 -0.0205369 unknown
polarizability: 124.4640887|5.7589797|69.9883643|-0.1787987|-0.1746781|54.7019752 unknown
InChI: InChI=1S/C6H10BrN/c7-5-3-1-2-4-6-8/h1-5H2
charge 0 multiplicity 1
18 atoms
Br 4.752058 0.661881 -0.020848
N  -4.277813 0.639107 -0.005862
C  0.569703 -0.626301 0.002644
C  -0.740557 0.193045 -0.003544
C  1.820747 0.290074 -0.008796
C  -1.990001 -0.73237 0.007244
C  3.108408 -0.536956 -0.00547
C  -3.258267 0.017644 -0.000337
H  0.590313 -1.297494 -0.880748
H  0.593373 -1.279437 0.89936
H  -0.772969 0.859772 0.878626
H  -0.775328 0.842264 -0.898596
H  1.805406 0.955551 0.874711
H  1.800227 0.94027 -0.903539
H  -1.971492 -1.402078 -0.874704
H  -1.970889 -1.3826 0.903642
H  3.215385 -1.164145 -0.904462
H  3.220796 -1.148528 0.903578
