program: Gaussian 09
title: 000081080
version: EM64L-G09RevD.01
frameworkgroup: C1[X(C14H22O4)]
method: RPBEPBE
basis: SDD
operation: Freq
keyword: #pfreq=noraman
keyword: PBEPBE/SDD
title: #p freq=noraman PBEPBE/SDD
converged: YES YES NO NO
title: Mulliken charges:
elementType: O O O O C C C C C C C C C C C C C C H H H H H H H H H H H H H H H H H H H H H H
charge: -0.273192 -0.273192 -0.250720 -0.250721 -0.373435 -0.373434 -0.393272 -0.393272 -0.280287 -0.280286 0.161512 0.161512 0.341922 0.341922 -0.755136 -0.755136 -0.632798 -0.632797 0.197748 0.197717 0.197717 0.197747 0.212702 0.212694 0.212702 0.212693 0.228091 0.227932 0.228091 0.227932 0.214871 0.240054 0.239783 0.214871 0.240054 0.239784 0.228610 0.255204 0.228610 0.255204
chargesum: 0.00000
title: Mulliken charges with hydrogens summed into heavy atoms:
elementType: O O O O C C C C C C C C C C C C C C
charge: -0.273192 -0.273192 -0.250720 -0.250721 0.022029 0.022030 0.032124 0.032124 0.175736 0.175736 0.161512 0.161512 0.341922 0.341922 -0.060428 -0.060428 -0.148984 -0.148983
polarizability: 2.57683023e+02 -7.71857386e+00 1.53929056e+02 6.62656197e-04 7.52220877e-04 1.01858887e+02
1716.lowfreq: -0.0014 -0.0009 0.0001 1.6782 6.3765 7.6803 7.7937 17.4192 28.3862
frequency: 7.6804 17.4192 28.3861 29.1368 55.6545 64.8992 68.5729 70.7704 82.3293 121.9571 131.5588 131.8679 135.0908 164.1320 165.4048 172.2177 179.9635 210.0218 261.9323 314.6630 327.4032 370.7329 374.9387 393.9165 393.9598 414.5103 450.4990 514.2644 533.2221 579.1015 580.1994 633.7642 633.8041 731.8037 753.4092 784.1709 785.0774 793.6684 805.9819 809.6035 873.7813 910.6306 920.5151 954.7641 956.9193 980.0534 989.2668 989.3140 1010.2142 1010.6525 1022.8285 1032.0325 1053.7739 1053.7814 1076.2027 1084.8799 1112.4635 1116.5436 1120.7475 1143.4213 1162.6653 1219.3465 1229.8318 1260.2160 1272.4375 1277.8611 1288.5381 1291.1040 1293.9257 1296.7133 1331.8727 1361.5872 1375.0480 1378.3032 1396.8437 1396.8600 1415.8118 1415.8252 1456.4619 1456.4654 1465.2722 1467.2734 1469.0497 1472.3115 1473.4460 1476.1229 1484.3676 1490.8043 1606.9255 1607.0720 1654.0263 1654.1509 2959.0212 2965.7335 2988.8372 2989.8126 2989.9584 2990.0835 2997.9788 2999.8118 3000.3336 3020.3346 3040.9664 3047.4420 3072.3740 3073.8297 3073.9654 3075.0703 3097.4671 3097.5083 3104.3716 3104.3766 3216.3283 3216.3299
redmass: 4.4471 3.9596 4.5862 3.4549 3.7239 3.4514 4.4434 2.0532 3.6454 1.9176 4.0671 2.4694 7.0452 1.2128 1.0698 2.0890 2.7677 3.9661 4.5614 3.7012 4.4810 3.4320 2.7092 3.6082 3.6044 3.2876 3.7576 4.6439 4.7508 3.7284 3.7199 1.5305 1.5299 1.0660 1.0905 1.8952 2.0749 1.2183 8.7276 8.0700 1.2268 4.7967 3.7568 2.2500 2.5307 1.1883 1.3184 1.3182 1.4193 1.3935 4.0222 4.3624 1.5051 1.5049 2.3633 2.7434 3.5871 4.5885 5.1453 1.5907 1.2494 1.3340 1.2601 1.2078 1.0870 1.4670 3.1662 1.1078 2.6504 1.0935 1.4049 1.5288 1.6182 1.5948 1.1661 1.1661 1.2497 1.2493 1.0452 1.0452 1.0806 1.0752 1.0740 1.0635 1.0640 1.0842 1.0898 1.0977 11.3897 11.3853 5.1533 5.1589 1.0590 1.0592 1.0599 1.0475 1.0364 1.0478 1.0988 1.0568 1.0566 1.1024 1.1037 1.1051 1.1078 1.0978 1.0974 1.1065 1.1007 1.1007 1.0619 1.0619 1.1155 1.1155
irintensity: 1.9407 0.6808 0.6589 0.0000 2.7241 0.0000 0.0000 0.0000 0.4752 3.0065 4.0337 0.2389 0.0001 0.0003 0.4606 0.0000 10.4341 0.0001 8.1143 7.8290 0.0000 23.6661 0.0000 0.0011 0.4520 6.7164 0.0000 0.0001 2.2288 4.5317 0.0000 0.0001 20.2755 11.2702 0.0000 18.1925 0.0004 0.3525 19.1299 0.0003 0.0000 0.0001 30.0731 0.0001 36.3109 0.8375 0.0001 119.4565 47.5810 0.0006 6.6820 0.0000 0.0503 12.9593 0.0000 144.3638 0.0000 908.1139 0.0018 0.0072 2.6210 0.0003 8.6176 0.2786 0.0000 0.0002 222.6354 0.7833 0.0004 0.0000 6.3653 0.0000 0.0000 5.3903 0.0144 45.1112 22.4817 0.0184 0.0427 30.4526 4.2317 0.0000 0.0000 79.2674 0.0003 4.6095 0.0001 25.0636 288.2865 0.0486 8.6016 0.0012 0.0000 36.3532 0.0003 0.3082 0.0038 59.7683 0.0002 0.0014 84.1969 13.1251 0.0001 16.0623 0.0010 5.3807 0.0326 174.8339 58.9910 0.0165 10.3310 0.0000 11.6443 0.0720
temp: 298.150 k
press: 1.00000 atm
elementType: 8 8 8 8 6 6 6 6 6 6 6 6 6 6 6 6 6 6 1 1 1 1 1 1 1 1 1 1 1 1 1 1 1 1 1 1 1 1 1 1
symmnumber: 1
zpe: 876330.1 jmol-1
zpe.correction: 0.333777 hartree
zpe.thermalcorrener: 0.355608 hartree
zpe.thermalcorrenthalpy: 0.356552 hartree
zpe.thermalcorrgfe: 0.277548 hartree
zpe.sumelectzpe: -846.144044 hartree
zpe.sumelectthermal: -846.122212 hartree
zpe.sumelectthermalent: -846.121268 hartree
zpe.sumelectthermalfe: -846.200272 hartree
dipole: 0.0000 0.0000 0.0076
dipole: 0.0076
quadrupole: -107.1654 -116.7986 -108.6935
quadrupole: 27.4154 0.0006 0.0000
quadrupole: 3.7204 -5.9128 2.1923 27.4154 0.0006 0.0000
hfenergy: -846.4778206 hartree
pointgroup: C01 [X(C14H22O4)]
dipole: -0.000012 -0.0000004 0.0029941 debye
polarizability: 257.7767511|-7.059951|153.835328|0.0006579|0.0007564|101.8588867 unknown
InChI: InChI=1S/C14H22O4/c1-11(2)13(15)17-9-7-5-6-8-10-18-14(16)12(3)4/h1,3,5-10H2,2,4H3
charge 0 multiplicity 1
40 atoms
O  4.382461 0.171252 0.046215
O  -4.382473 -0.171286 0.046222
O  5.639074 -1.790955 0.038464
O  -5.639078 1.790926 0.03851
C  0.610761 -0.472975 0.045719
C  -0.610773 0.472936 0.045731
C  1.954589 0.292617 0.045806
C  -1.954601 -0.292655 0.045808
C  3.146951 -0.663952 0.045606
C  -3.146962 0.663915 0.045624
C  5.592417 -0.534998 0.042238
C  -5.592428 0.534968 0.042289
C  6.766938 0.400694 0.042933
C  -6.766954 -0.400717 0.042903
C  6.515323 1.894257 0.043365
C  -6.515351 -1.894283 0.043272
C  8.007642 -0.160697 0.042544
C  -8.007655 0.160682 0.042499
H  0.559778 -1.135881 -0.842687
H  0.55975 -1.135989 0.934047
H  -0.559758 1.135933 0.934071
H  -0.559793 1.135859 -0.842663
H  2.01426 0.948862 0.935469
H  2.014254 0.949148 -0.843643
H  -2.014271 -0.948913 0.935462
H  -2.014268 -0.949173 -0.843651
H  3.163359 -1.314291 -0.849008
H  3.163028 -1.314824 0.939864
H  -3.16337 1.314267 -0.848981
H  -3.163036 1.314774 0.939892
H  7.4681 2.450377 0.04896
H  5.921809 2.196294 0.92475
H  5.931973 2.198126 -0.844364
H  -7.468134 -2.450394 0.048813
H  -5.921865 -2.196366 0.92466
H  -5.931979 -2.198115 -0.844454
H  8.913043 0.455755 0.043037
H  8.12453 -1.249923 0.041323
H  -8.91306 -0.455764 0.042935
H  -8.124535 1.249909 0.04132
