program: Gaussian 09
title: 000081070
version: EM64L-G09RevD.01
frameworkgroup: C1[X(C9H8Cl2O3)]
method: RPBEPBE
basis: SDD
operation: Freq
keyword: #p
keyword: freq=noraman
keyword: PBEPBE/SDD
title: #p freq=noraman PBEPBE/SDD
converged: YES YES NO NO
title: Mulliken charges:
elementType: Cl Cl O O O C C C C C C C C C H H H H H H H H
charge: -0.022603 -0.016760 -0.279352 -0.235051 -0.234349 0.356095 0.328722 -0.280332 -0.301020 -0.238241 -0.213420 0.165210 -0.517060 -0.496373 0.264743 0.263586 0.260418 0.226471 0.237384 0.246941 0.239195 0.245794
chargesum: 0.00000
title: Mulliken charges with hydrogens summed into heavy atoms:
elementType: Cl Cl O O O C C C C C C C C C
charge: -0.022603 -0.016760 -0.279352 -0.235051 -0.234349 0.356095 0.328722 -0.280332 -0.301020 0.026502 0.050166 0.165210 0.207213 0.235557
polarizability: 1.71185642e+02 -6.09633624e+00 1.39443685e+02 -1.66198393e+00 -1.88659132e+00 6.86985837e+01
1716.lowfreq: -7.4133 -5.0338 0.0019 0.0023 0.0024 9.7394 43.5505 61.5429 85.5009
frequency: 43.5249 61.5388 85.4954 90.2059 104.7412 107.7128 130.0920 151.2264 184.1710 203.0105 225.8644 246.4874 282.4306 311.3217 314.0719 329.0072 405.4559 450.4828 528.9931 542.4609 579.9477 617.6314 688.9189 717.2127 763.1116 798.0336 805.9205 823.7863 920.3779 940.3962 956.1813 1066.9649 1110.4994 1111.5115 1124.2354 1148.5646 1152.0131 1159.5128 1217.5054 1233.8776 1347.0778 1380.8011 1415.1734 1427.9828 1441.7239 1452.6339 1460.0449 1460.5024 1472.5511 1554.2226 1580.6574 1624.0737 2984.2079 3008.2360 3089.4082 3112.2970 3135.3557 3157.4695 3166.6926 3186.1649
redmass: 4.9743 4.8857 1.5157 5.4879 2.4594 3.1888 4.0914 1.1050 14.4661 6.2863 5.4950 8.0994 5.5289 10.1747 10.9730 5.3697 5.9845 6.1756 6.5811 7.8836 5.5903 6.5129 7.3013 8.3087 8.4499 6.7296 1.3753 7.5304 8.7344 1.3453 9.5405 7.5235 1.2745 1.2521 1.7847 1.5313 1.3304 2.1839 2.8036 3.4765 11.0601 3.0055 1.5883 1.7867 1.3871 1.0507 1.0520 1.0546 1.0553 7.3937 9.1227 10.3672 1.0297 1.0294 1.1060 1.1049 1.1030 1.1049 1.0889 1.0975
irintensity: 1.5753 2.8254 0.5059 2.0330 0.1303 7.8966 5.1477 0.7125 1.0759 1.7705 6.7708 1.1351 11.5590 2.5647 0.8480 5.9246 7.2132 7.1086 25.3212 11.2267 13.7352 8.7698 6.8303 15.5471 6.5272 15.0808 42.2317 20.8499 37.1077 0.9705 116.2504 57.2814 0.2577 2.3187 3.5236 7.6256 3.2824 146.7631 58.7133 230.3852 1.7919 97.7947 43.0253 30.0752 46.4251 12.4151 10.1849 12.1584 12.9856 8.6921 25.2493 199.9254 50.9564 29.0573 15.7432 19.3040 18.1732 12.9441 0.2006 0.7685
temp: 298.150 k
press: 1.00000 atm
elementType: 17 17 8 8 8 6 6 6 6 6 6 6 6 6 1 1 1 1 1 1 1 1
symmnumber: 1
zpe: 395914.7 jmol-1
zpe.correction: 0.150796 hartree
zpe.thermalcorrener: 0.165589 hartree
zpe.thermalcorrenthalpy: 0.166533 hartree
zpe.thermalcorrgfe: 0.107706 hartree
zpe.sumelectzpe: -1492.486069 hartree
zpe.sumelectthermal: -1492.471276 hartree
zpe.sumelectthermalent: -1492.470332 hartree
zpe.sumelectthermalfe: -1492.529159 hartree
dipole: -0.2809 0.3672 0.2790
dipole: 0.5400
quadrupole: -86.9185 -84.8096 -98.3483
quadrupole: 6.0965 6.7392 0.4962
quadrupole: 3.1070 5.2159 -8.3229 6.0965 6.7392 0.4962
hfenergy: -1492.6368653 hartree
pointgroup: C01 [X(C9H8Cl2O3)]
dipole: 0.0558285 -0.1934813 0.0677036 debye
dipolederiv: -0.4355755 0.3731953 0.0401075 0.3123935 -0.4711221 -0.0567818 0.0106437 -0.0439358 -0.0449099 -0.5304578 0.307165 0.0170481 0.3458994 -0.3422408 -0.0282827 0.0257166 -0.0399485 -0.0471766 -0.4018712 -0.0744317 -0.0462192 -0.0638561 -1.2469627 -0.4228312 -0.0110066 -0.2905849 -0.4914747 -1.1073215 -0.1242502 0.412524 -0.1134447 -0.2996573 -0.05295 0.6166659 -0.0112328 -0.8429809 -0.6955227 -0.1704443 -0.1606313 -0.1027134 -0.418142 -0.2514535 0.1504649 -0.1262941 -0.8206651 -0.3752217 0.1343323 0.0422605 -0.0853636 -0.2951055 -0.0813042 -0.0166908 -0.0899391 -0.069993 0.1573485 0.2304992 0.0762411 0.2003368 0.961632 0.2768841 -0.0163178 0.0349752 0.0290353 0.6590607 -0.6000773 -0.0665416 -0.3235697 0.689734 0.0609935 0.048166 0.0870715 -0.0490493 0.6470726 -0.6573465 -0.0691873 -0.5539617 0.2768747 -0.0113401 -0.0445033 0.0506616 -0.0786246 -0.2643038 0.1654863 0.0185629 0.1073852 -0.1411485 -0.0039131 0.0066319 0.0052083 -0.111862 -0.078807 0.0964166 0.0045856 0.0331671 0.0140938 0.0180425 0.0005041 0.009102 -0.0812732 1.4584218 0.3333505 -0.2118664 0.2065745 0.4187674 0.3571065 -0.6513248 0.1692698 1.3936406 0.2531451 -0.0356969 -0.0166531 0.0014642 0.4898891 0.2182998 0.0199625 0.400916 0.5337122 0.6290143 0.0474333 -0.1574288 0.1161749 0.2644265 -0.0627339 -0.0962576 -0.0267208 0.2610521 0.0751583 -0.0052855 -0.0006065 -0.021368 -0.0203263 -0.0255208 -0.0081732 -0.0241342 0.1668285 -0.0208566 -0.0306829 -0.0068728 -0.0205489 0.0820936 -0.0121142 0.000615 -0.0130207 0.1621122 0.0206294 0.0156655 -0.1099127 0.0542445 0.0638692 0.0572082 -0.0672185 -0.0502958 -0.0118445 -0.0880626 0.0188625 0.1322743 -0.048072 0.0742232 0.0015185 0.0477986 -0.0557409 -0.0059403 0.1110826 -0.0407751 0.004798 -0.0320197 -0.1373967 -0.0170807 0.0051522 0.015977 0.065605 0.0014447 0.0167683 0.0400936 -0.0591961 -0.0952313 0.0028572 -0.0215249 -0.0500561 0.103367 0.0318539 -0.0093417 0.0562716 0.0177818 0.1038611 -0.0516168 0.104136 -0.0317522 -0.0627089 -0.0462313 0.0091573 0.0011526 0.028692 0.0278685 0.0850125 -0.1034399 0.0804743 0.00315 unknown
polarizability: 162.4955442|-14.1463009|143.7569201|-6.8513798|18.0352552|73.0754462 unknown
InChI: InChI=1S/C9H8Cl2O3/c1-13-8-6(11)4-3-5(10)7(8)9(12)14-2/h3-4H,1-2H3
charge 0 multiplicity 1
22 atoms
Cl 1.26476 -2.806627 -0.348942
Cl -3.538846 1.439704 0.118042
O  -0.531493 2.088896 0.142681
O  2.362486 0.130856 -1.077608
O  2.097195 0.876023 1.112602
C  0.235796 -0.206202 -0.049923
C  -0.834908 0.726349 0.071651
C  -0.068549 -1.572071 -0.237527
C  -2.16853 0.25531 0.002413
C  -1.396665 -2.035504 -0.302058
C  -2.455321 -1.109497 -0.183434
C  1.638556 0.322518 0.086343
C  -0.571802 2.698406 1.49862
C  3.778278 0.57853 -1.037141
H  -1.603311 -3.099324 -0.442413
H  -3.493382 -1.448312 -0.240015
H  0.231818 2.262203 2.117411
H  -1.562741 2.549715 1.964574
H  -0.391018 3.770041 1.33141
H  3.82609 1.661546 -0.836062
H  4.172292 0.338655 -2.033771
H  4.323396 0.033788 -0.248351
