program: Gaussian 09
title: 000081060
version: EM64L-G09RevD.01
frameworkgroup: C1[X(C9H8Cl2O)]
method: RPBEPBE
basis: SDD
operation: Freq
keyword: #p
keyword: freq=noraman
keyword: PBEPBE/SDD
title: #p freq=noraman PBEPBE/SDD
converged: YES YES NO NO
title: Mulliken charges:
elementType: Cl Cl O C C C C C C C C C H H H H H H H H
charge: -0.017911 -0.010138 -0.187762 0.566670 -0.670305 -0.365487 -0.391829 0.224235 -0.063264 -0.199954 -0.105889 -0.751575 0.244209 0.240506 0.258452 0.237879 0.257467 0.262950 0.235667 0.236078
chargesum: 0.00000
title: Mulliken charges with hydrogens summed into heavy atoms:
elementType: Cl Cl O C C C C C C C C C
charge: -0.017911 -0.010138 -0.187762 0.566670 -0.185590 -0.107035 -0.153951 0.224235 -0.063264 0.057513 -0.105889 -0.016879
polarizability: 1.64306214e+02 3.26333099e+00 1.13146264e+02 1.56370932e+01 -5.74257812e-01 6.94358948e+01
1716.lowfreq: -36.6409 -22.9098 -2.6519 -0.0027 -0.0023 0.0015 2.7435 7.7646 56.3693
frequency: -36.4150 -22.6629 56.3685 79.0413 124.9562 181.3413 190.0983 229.0152 275.3521 315.0219 359.6477 425.9552 435.6002 443.1466 456.2440 527.1080 575.3064 654.2820 680.0397 710.0453 781.3303 828.5327 831.8056 866.7253 885.9138 950.2674 963.5233 1002.9320 1015.4333 1119.4550 1143.3021 1162.3775 1176.6971 1216.1385 1256.3054 1289.3659 1368.7142 1371.7333 1386.6094 1436.7336 1447.9400 1456.1523 1463.8485 1574.2307 1601.2789 1649.3042 2976.3507 2983.6688 3027.9727 3064.9719 3125.7468 3139.3346 3154.2689 3170.7360
redmass: 2.0393 7.0409 7.9733 1.3303 6.3760 18.8380 7.8242 3.2591 4.2172 6.7769 4.1626 3.5086 3.6187 4.9185 2.8426 5.4401 4.7963 6.3743 5.4543 3.9787 2.2965 1.6241 1.5391 4.3587 1.5468 1.3955 2.0275 4.8479 1.6893 2.0604 1.5390 2.3391 1.2259 1.9749 1.4595 1.9812 1.2353 7.6010 2.8147 1.0860 1.1058 1.0510 2.9076 7.7050 6.7619 7.9107 1.0542 1.0436 1.0984 1.0965 1.0998 1.0897 1.0924 1.0961
irintensity: 2.0532 2.5801 1.2722 0.0530 1.7144 0.0623 0.6863 0.9650 2.1659 0.7511 0.9518 2.9661 12.5667 16.2301 1.3777 1.1551 9.4392 13.4696 6.8845 11.4656 16.0862 2.9666 16.6062 24.5739 16.2101 1.0688 6.4653 36.5822 5.1985 38.9561 5.4011 94.9579 0.4433 18.4586 9.0736 79.0960 59.4105 1.3007 19.4882 0.8099 41.3320 20.5716 78.3288 16.7308 4.1198 86.0187 11.6287 20.4338 4.1916 13.1667 11.7431 8.5745 2.3048 3.2915
temp: 298.150 k
press: 1.00000 atm
elementType: 17 17 8 6 6 6 6 6 6 6 6 6 1 1 1 1 1 1 1 1
symmnumber: 1
zpe: 374480.6 jmol-1
zpe.correction: 0.142632 hartree
zpe.thermalcorrener: 0.153150 hartree
zpe.thermalcorrenthalpy: 0.154094 hartree
zpe.thermalcorrgfe: 0.105148 hartree
zpe.sumelectzpe: -1342.222873 hartree
zpe.sumelectthermal: -1342.212355 hartree
zpe.sumelectthermalent: -1342.211411 hartree
zpe.sumelectthermalfe: -1342.260358 hartree
dipole: -4.4159 -1.0311 -3.2387
dipole: 5.5725
quadrupole: -75.6451 -77.6779 -89.8376
quadrupole: -1.7161 8.9266 -0.2524
quadrupole: 5.4084 3.3756 -8.7840 -1.7161 8.9266 -0.2524
hfenergy: -1342.3655051 hartree
pointgroup: C01 [X(C9H8Cl2O1)]
dipole: 1.6762867 -0.5287522 1.3103484 debye
dipolederiv: -0.2877721 0.2852705 -0.0301934 0.3393127 -0.5323841 0.0349948 -0.0336187 0.0285676 -0.044086 -0.7278996 -0.1042553 -0.1586208 -0.1086668 -0.0848807 -0.02737 -0.1737806 -0.0287183 -0.0747214 -0.6246792 -0.0190716 -0.090989 -0.0345342 -0.2482439 0.0304403 0.0397548 0.0343243 -0.8130556 0.3586015 0.0415151 0.0225282 0.0062774 0.0320326 0.0055029 0.0939771 0.0142805 -0.0709692 -0.2797654 -0.0484551 0.1752203 -0.0499543 0.1182085 0.0305562 0.4346097 0.049183 -0.2328933 -0.2164702 0.1408906 0.0062647 0.1035029 -0.1259877 0.008343 -0.0523403 0.0034286 -0.0867407 -0.1001177 -0.054566 0.0307938 -0.0523815 0.0398187 0.0135558 -0.0236756 0.0262524 -0.1331661 1.2319929 0.0810854 -0.0126751 0.1209753 0.0733049 -0.0652063 -0.3743974 -0.0802026 1.0019922 0.2004109 -0.5489892 0.0103311 -0.4913395 0.7679253 -0.0384443 0.0198986 -0.0733321 -0.0226032 -0.204309 -0.0519672 -0.0270578 0.0359904 0.0234099 0.0133928 -0.0197414 -0.0010877 -0.0833552 0.951292 0.303165 0.2602767 0.1853075 -0.0983986 0.0353068 0.263076 0.0703968 0.0036536 -0.6009751 -0.0387838 -0.1056875 -0.0460946 0.0384189 0.0033618 -0.0326986 0.0046851 -0.0659478 0.0154166 -0.0275658 -0.0013019 -0.0709352 -0.0218175 -0.1085893 -0.0624525 -0.0542106 0.0528032 -0.0159319 0.0425544 -0.0251069 0.077687 -0.0180274 0.1024151 -0.0665355 0.0376939 0.065215 0.0650124 -0.0602748 -0.035754 -0.0578932 -0.0051509 -0.0203767 -0.0321413 -0.0210633 0.1354046 0.0059552 0.1011567 -0.0365775 0.0913658 -0.0161893 0.0034572 -0.0339206 0.0070473 0.136494 0.0619005 -0.0460193 -0.0241224 -0.045734 -0.0168298 -0.021911 -0.0305514 -0.0229344 0.1539037 -0.020371 -0.0168084 0.0552873 -0.0248492 0.1181563 0.0182431 0.1148565 0.024142 -0.0257222 0.0973351 0.0221737 0.0044852 -0.0351976 -0.0046875 -0.114191 -0.0099641 -0.1134414 0.0305937 0.090374 -0.0010549 -0.017101 0.0571609 -0.0386775 0.096519 -0.0203548 0.0949889 0.0732008 unknown
polarizability: 162.8080868|-5.9921494|113.3958428|18.6008652|1.6986984|70.6844431 unknown
InChI: InChI=1S/C9H8Cl2O/c1-6(12)4-7-2-3-8(10)9(11)5-7/h2-3,5H,4H2,1H3
charge 0 multiplicity 1
20 atoms
Cl -2.702855 2.294389 -0.027895
Cl -3.985072 -0.693721 -0.559644
O  2.473408 0.158703 -1.481112
C  0.498981 -0.205026 0.57583
C  1.965914 -0.050536 0.919601
C  -0.330725 0.934483 0.452425
C  -0.064379 -1.483577 0.341549
C  2.90258 0.113059 -0.303063
C  -1.690127 0.797549 0.108395
C  -1.424015 -1.624046 -0.004768
C  -2.241016 -0.480499 -0.119824
C  4.388951 0.219205 0.024765
H  2.131945 0.82945 1.573159
H  2.331257 -0.922163 1.498594
H  0.074638 1.938069 0.617199
H  0.560058 -2.380148 0.423091
H  -1.857612 -2.611765 -0.186196
H  4.969971 0.362991 -0.898729
H  4.577006 1.065384 0.712698
H  4.738995 -0.6966 0.538128
