program: Gaussian 09
title: 000081091
version: EM64L-G09RevD.01
frameworkgroup: C1[X(C9H14ClN5O2)]
method: RPBEPBE
basis: SDD
operation: Freq
keyword: #p
keyword: freq=noraman
keyword: PBEPBE/SDD
title: #p freq=noraman PBEPBE/SDD
converged: NO YES NO NO
title: Mulliken charges:
elementType: Cl O O N N N N N C C C C C C C C C H H H H H H H H H H H H H H
charge: -0.018380 -0.252759 -0.249507 -0.338458 -0.330459 -0.118887 -0.009164 -0.022921 -0.437503 -0.305157 0.105495 0.104310 0.226701 -0.714223 -0.225185 -0.669251 -0.291283 0.270336 0.270173 0.232645 0.233145 0.369767 0.337488 0.225325 0.224719 0.231346 0.235015 0.235066 0.216878 0.232365 0.232367
chargesum: 0.00000
title: Mulliken charges with hydrogens summed into heavy atoms:
elementType: Cl O O N N N N N C C C C C C C C C
charge: -0.018380 -0.252759 -0.249507 0.031310 0.007028 -0.118887 -0.009164 -0.022921 0.103006 0.160633 0.105495 0.104310 0.226701 -0.032834 0.244896 0.012358 -0.291283
polarizability: 2.08301250e+02 -7.56640650e+00 1.85589682e+02 2.76794160e-02 -9.16601850e-02 8.27780537e+01
1716.lowfreq: -12.2293 -4.3650 -0.0031 -0.0021 -0.0020 2.1671 11.2361 30.6658 37.1417
frequency: -4.0482 30.5252 37.0291 41.7111 59.1231 89.6269 99.1686 103.4809 145.1638 145.2028 185.3009 196.8130 202.9002 223.9186 241.5104 246.2703 267.0125 307.6409 319.7879 354.7545 400.5774 470.8897 546.5154 547.1579 553.2015 606.0231 637.6265 662.9537 670.2299 704.4647 717.5405 791.3316 796.7515 797.6485 809.0158 840.8118 885.4535 921.2013 939.9835 987.9824 1019.7754 1030.1469 1094.3314 1114.3588 1135.7471 1145.7289 1146.8278 1150.1459 1178.2990 1196.0324 1204.4889 1211.6997 1251.3233 1260.4572 1312.7393 1333.4061 1357.7527 1375.2673 1385.6901 1400.4842 1402.1821 1462.3619 1463.6330 1467.7066 1473.0939 1478.5538 1482.6212 1485.7440 1497.6160 1513.1917 1541.9589 1603.1439 1640.3517 2987.2101 2990.1846 2992.1795 2998.8075 3015.4356 3032.1029 3032.1087 3075.8020 3082.7712 3096.0386 3096.8420 3111.5964 3520.8061 3561.3905
redmass: 2.6738 3.6999 2.4500 4.4208 6.5501 2.8039 4.3025 3.7739 4.0563 2.7557 6.6799 6.3339 2.8214 4.5811 6.4161 1.2607 1.4963 6.8224 3.5478 4.5852 6.1855 6.3817 5.1672 2.7265 1.1793 8.4324 4.0309 7.0326 1.3807 9.1046 5.8669 5.8429 1.2129 1.0980 4.2400 4.6443 6.9887 5.3505 2.2400 2.0253 2.2994 4.8155 3.2801 2.2941 1.4628 1.5202 6.9913 3.7184 3.0551 1.0852 3.3460 3.7725 1.1336 1.1013 1.8665 1.6185 1.4587 2.0083 2.5832 1.2372 1.2841 1.3507 1.0398 1.5236 1.0648 1.0398 1.1278 1.0682 1.1098 2.9539 8.3519 7.7561 9.3122 1.0386 1.0575 1.0595 1.0359 1.0581 1.1006 1.1035 1.1069 1.1012 1.0986 1.0985 1.1031 1.0774 1.0773
irintensity: 0.0002 0.0012 0.2999 0.0957 0.5805 2.0038 0.6360 0.0872 3.0282 6.0676 8.2571 0.1237 0.6778 0.7457 11.4798 1.9463 0.8003 30.1043 2.7022 3.8705 9.6423 4.2489 19.4216 2.4725 97.0690 10.0665 3.3035 7.4251 93.6303 1.7738 18.5189 40.9977 0.0449 4.4970 31.0730 24.1246 21.1754 3.9899 12.5090 1.8110 60.8964 16.6584 30.8335 6.3892 6.2569 2.0338 277.8479 92.9237 366.8896 0.0215 113.6415 5.5320 0.0437 0.0221 60.2637 119.4880 16.6629 31.7054 230.3517 32.6581 11.0441 203.8937 12.9801 144.0474 12.6400 13.4063 6.0364 9.1750 92.3246 18.9190 1469.0003 385.5470 167.5871 28.6439 11.7457 49.5061 18.1122 16.3781 2.4365 17.0504 5.5266 47.7393 26.9616 28.1945 41.9676 181.6754 71.6907
temp: 298.150 k
press: 1.00000 atm
elementType: 17 8 8 7 7 7 7 7 6 6 6 6 6 6 6 6 6 1 1 1 1 1 1 1 1 1 1 1 1 1 1
symmnumber: 1
zpe: 628006.2 jmol-1
zpe.correction: 0.239195 hartree
zpe.thermalcorrener: 0.256684 hartree
zpe.thermalcorrenthalpy: 0.257628 hartree
zpe.thermalcorrgfe: 0.191364 hartree
zpe.sumelectzpe: -1234.353528 hartree
zpe.sumelectthermal: -1234.336039 hartree
zpe.sumelectthermalent: -1234.335095 hartree
zpe.sumelectthermalfe: -1234.401358 hartree
dipole: -4.7701 6.4585 -0.0088
dipole: 8.0291
quadrupole: -91.6930 -107.9492 -106.0440
quadrupole: 12.0717 -0.0412 -0.0013
quadrupole: 10.2024 -6.0538 -4.1486 12.0717 -0.0412 -0.0013
hfenergy: -1234.5927225 hartree
pointgroup: C01 [X(C9H14Cl1N5O2)]
dipole: 1.674963 -2.6782552 -0.0032039 debye
polarizability: 207.0012617|-9.2241503|186.8896954|-0.0402203|0.0732148|82.7780292 unknown
InChI: InChI=1S/C9H14ClN5O2/c1-3-11-8-13-7(10)14-9(15-8)12-5-6(16)17-4-2/h11-12H,3-5H2,1-2H3
charge 0 multiplicity 1
31 atoms
Cl -3.80891 3.256094 0.003029
O  3.996498 -0.523271 -0.00128
O  3.354158 1.721263 -0.000708
N  0.708699 1.048599 -0.002225
N  -3.091665 -1.71889 -0.001489
N  -1.13575 -0.406328 -0.002125
N  -1.41226 2.030213 0.000696
N  -3.370534 0.600849 0.000934
C  1.651867 -0.061324 -0.004213
C  -2.344215 -2.98777 -0.004839
C  -0.643081 0.874238 -0.001139
C  -2.504686 -0.488226 -0.000896
C  3.06776 0.50087 -0.003371
C  -3.316373 -4.178216 0.009622
C  5.44096 -0.111142 0.001873
C  6.261877 -1.394919 0.003849
C  -2.734645 1.785289 0.001757
H  1.513388 -0.716341 0.877338
H  1.513652 -0.713061 -0.888294
H  -1.691964 -3.025766 -0.898252
H  -1.67377 -3.018311 0.87502
H  1.081132 2.003371 -0.001916
H  -4.113307 -1.724592 -0.002474
H  -3.952588 -4.1666 0.913612
H  -3.972228 -4.172478 -0.880369
H  -2.752871 -5.126816 0.006311
H  5.619965 0.510286 -0.893571
H  5.616035 0.510517 0.897927
H  7.33869 -1.146696 0.006127
H  6.044056 -2.002125 0.898691
H  6.047911 -2.002417 -0.891725
