program: Gaussian 09
title: 000081053
version: EM64L-G09RevD.01
frameworkgroup: C1[X(C7H3ClN2O2)]
method: RPBEPBE
basis: SDD
operation: Freq
keyword: #p
keyword: freq=noraman
keyword: PBEPBE/SDD
title: #p freq=noraman PBEPBE/SDD
converged: YES YES NO YES
title: Mulliken charges:
elementType: Cl O O N N C C C C C C C H H H
charge: 0.034563 -0.191459 -0.156587 0.022749 0.024380 0.263126 0.396597 -0.363718 -0.279682 -0.182634 -0.216420 -0.182350 0.299996 0.255998 0.275442
chargesum: 0.00000
title: Mulliken charges with hydrogens summed into heavy atoms:
elementType: Cl O O N N C C C C C C C
charge: 0.034563 -0.191459 -0.156587 0.022749 0.024380 0.263126 0.396597 -0.063722 -0.279682 0.073364 0.059021 -0.182350
polarizability: 1.36393078e+02 7.96717677e+00 1.41305150e+02 4.30773752e-03 2.42758636e-03 3.87569027e+01
1716.lowfreq: -9.0430 -7.1697 0.0006 0.0014 0.0018 5.0903 28.7889 69.0272 161.2073
frequency: 28.7188 69.0263 161.2071 182.8241 183.2434 201.9422 303.6370 327.9181 396.9703 398.4765 431.5675 486.0107 537.5281 565.1156 600.3144 681.0477 697.2974 735.5159 766.0467 810.2149 823.1273 937.0099 998.5983 1063.6673 1090.4084 1165.4187 1194.6630 1198.5800 1202.9387 1366.6760 1379.8664 1422.8615 1441.6471 1561.6620 1596.4097 2182.9301 3163.4009 3181.5766 3194.9678
redmass: 15.0288 12.8750 16.7446 14.7352 5.2046 6.6389 9.1097 15.9170 6.2292 9.0823 12.7397 5.8237 9.8867 4.0393 6.9858 9.1318 11.2664 3.4770 6.5387 1.5672 9.9781 1.3669 1.3485 2.2767 7.6810 1.4398 1.5884 3.3086 6.0973 8.1215 8.3332 2.4317 3.6350 6.6726 8.1181 12.6306 1.0886 1.0945 1.0975
irintensity: 0.5592 0.2649 1.5466 1.3871 1.0858 0.0336 2.4815 0.2612 1.2482 4.5206 0.4281 4.7076 4.9183 2.1642 0.4324 3.2199 48.2553 33.0647 2.4033 43.7006 12.0855 0.6022 2.0444 13.2633 50.2769 8.9793 4.7377 104.1285 114.8707 27.0885 74.7064 10.4227 76.7567 0.0346 10.1274 1.0976 2.9866 2.1500 4.6268
temp: 298.150 k
press: 1.00000 atm
elementType: 17 8 8 7 7 6 6 6 6 6 6 6 1 1 1
symmnumber: 1
zpe: 231663.0 jmol-1
zpe.correction: 0.088236 hartree
zpe.thermalcorrener: 0.098394 hartree
zpe.thermalcorrenthalpy: 0.099338 hartree
zpe.thermalcorrgfe: 0.050972 hartree
zpe.sumelectzpe: -987.609485 hartree
zpe.sumelectthermal: -987.599326 hartree
zpe.sumelectthermalent: -987.598382 hartree
zpe.sumelectthermalfe: -987.646749 hartree
dipole: -2.3971 6.7608 0.0010
dipole: 7.1732
quadrupole: -83.4306 -76.4358 -74.2043
quadrupole: -0.7215 0.0014 0.0021
quadrupole: -5.4071 1.5878 3.8193 -0.7215 0.0014 0.0021
hfenergy: -987.6977205 hartree
pointgroup: C01 [X(C7H3Cl1N2O2)]
dipole: -1.6238919 -2.3081369 -0.0004096 debye
dipolederiv: -0.4658838 0.276737 0.000072 0.3464471 -0.2592686 -0.0000648 0.0000819 -0.0000682 -0.003411 -0.7600403 0.2437427 -0.0001943 0.1531625 -0.5851602 0.0003282 -0.0002161 0.0003754 -0.2194754 -0.5858962 -0.0651503 0.0001171 -0.058462 -0.6197702 0.0004523 0.0000093 0.0003134 -0.184332 1.5922094 -0.1008873 0.0001323 0.0950249 1.0432776 -0.0009639 0.0001941 -0.0007748 0.198638 -0.2209616 0.0597991 0.0000103 -0.0078911 -0.1035533 0.0000707 0.0000268 0.000033 -0.2161043 -0.5198988 -0.059008 0.0000031 -0.1498464 0.1570511 0.0001858 0.0000409 0.0000761 0.0615097 0.0071175 0.2026314 0.0000395 -0.0832388 0.0881133 0.0000222 0.0001584 0.0000114 0.172706 -0.0285546 -0.1679628 -0.0000183 0.0934046 -0.182506 -0.0000143 -0.0000942 -0.0000404 -0.0987035 0.6564207 -0.5311154 -0.0001218 -0.7527483 0.3438184 0.0001175 -0.0001529 0.0001324 -0.0790217 -0.0196908 0.1330966 0.0000033 0.0637887 0.1387809 0.0000232 -0.0000257 0.0000054 -0.1187576 -0.0260302 0.1144423 0.000015 0.2512422 -0.1043695 -0.0000344 0.0000269 -0.0000108 -0.0662102 0.1947069 -0.1029118 -0.0000877 0.0816658 -0.0842843 -0.0000563 -0.0001347 -0.0000477 0.0518391 0.1015398 0.0529715 0.0000186 0.0164685 0.109485 -0.0000303 0.0000592 0.0000277 0.1760113 0.0701495 -0.0262055 0.000003 -0.0353146 -0.0431636 -0.0000248 0.0000035 -0.000024 0.1608393 0.0048123 -0.0301796 0.0000078 -0.0137031 0.1015492 -0.000011 0.0000226 -0.0000087 0.1644724 unknown
polarizability: 132.6200173|-5.5413331|145.0782107|-0.0034959|0.0034969|38.7569027 unknown
InChI: InChI=1S/C7H3ClN2O2/c8-6-2-1-3-7(10(11)12)5(6)4-9/h1-3H
charge 0 multiplicity 1
15 atoms
Cl -3.052081 1.238404 0.00034
O  2.922959 -1.204985 0.000665
O  2.405577 1.015145 -0.001224
N  2.078895 -0.229045 -0.000338
N  0.025103 3.050466 0.00064
C  0.627622 -0.576359 -0.000222
C  -0.365045 0.450252 -0.000036
C  0.296518 -1.944859 -0.000316
C  -1.723174 0.016136 0.00005
C  -1.059457 -2.327596 -0.000279
C  -2.0748 -1.347125 -0.000094
C  -0.07941 1.859592 0.000178
H  1.104961 -2.679328 -0.000419
H  -1.32925 -3.387507 -0.000393
H  -3.130117 -1.632789 -0.000053
