program: Gaussian 09
title: 000081052
version: EM64L-G09RevD.01
frameworkgroup: C1[X(C7H3Cl2N)]
method: RPBEPBE
basis: SDD
operation: Freq
keyword: #p
keyword: freq=noraman
keyword: PBEPBE/SDD
title: #p freq=noraman PBEPBE/SDD
converged: YES YES YES YES
title: Mulliken charges:
elementType: Cl Cl N C C C C C C C H H H
charge: -0.021534 -0.021539 -0.001050 0.425882 -0.358999 -0.359004 -0.047296 -0.047290 -0.198704 -0.237525 0.288369 0.288370 0.290320
chargesum: 0.00000
title: Mulliken charges with hydrogens summed into heavy atoms:
elementType: Cl Cl N C C C C C C C
charge: -0.021534 -0.021539 -0.001050 0.425882 -0.070630 -0.070634 -0.047296 -0.047290 0.091616 -0.237525
polarizability: 1.21502966e+02 -5.50374310e-03 1.37168361e+02 -3.59775448e-03 -5.32226378e-03 3.60021376e+01
1716.lowfreq: -9.1083 -5.7784 -0.0033 -0.0013 -0.0008 4.2918 111.8785 119.6186 175.4882
frequency: 111.8785 119.6184 175.4882 176.2610 194.3498 330.4371 365.5346 393.5509 407.9822 449.6657 515.9383 571.4706 595.7061 675.0473 762.2015 853.7117 873.8926 894.5114 899.6620 979.9812 1097.8470 1108.1363 1207.7197 1259.9673 1366.2789 1404.4372 1423.9712 1554.9962 1592.0281 2186.8700 3182.9764 3184.2786 3186.1104
redmass: 12.2681 14.5205 20.1828 5.3928 4.5800 7.5703 21.3151 6.4931 9.2654 8.4677 5.3250 7.2088 5.9990 2.3139 11.2487 9.9270 1.4992 1.3671 1.5166 6.1420 1.4924 1.8487 4.2627 1.1870 8.8378 3.0678 3.1907 6.8449 7.1971 12.6304 1.0937 1.0939 1.0949
irintensity: 2.6591 3.5286 0.4629 0.4802 0.0000 1.0588 3.0592 2.9574 8.2500 0.0948 0.0000 0.0006 2.2367 23.3014 88.2847 30.5339 38.1913 0.0000 27.4808 0.7087 10.5517 6.5256 31.6258 1.0679 0.1586 44.5611 9.7546 136.8474 37.2222 13.2743 1.5189 2.3360 0.4771
temp: 298.150 k
press: 1.00000 atm
elementType: 17 17 7 6 6 6 6 6 6 6 1 1 1
symmnumber: 1
zpe: 203978.3 jmol-1
zpe.correction: 0.077691 hartree
zpe.thermalcorrener: 0.086458 hartree
zpe.thermalcorrenthalpy: 0.087402 hartree
zpe.thermalcorrgfe: 0.042663 hartree
zpe.sumelectzpe: -1242.710489 hartree
zpe.sumelectthermal: -1242.701723 hartree
zpe.sumelectthermalent: -1242.700778 hartree
zpe.sumelectthermalfe: -1242.745517 hartree
dipole: 0.0007 -2.5091 0.0006
dipole: 2.5091
quadrupole: -70.1040 -86.4745 -72.2622
quadrupole: 0.0050 -0.0001 0.0031
quadrupole: 6.1762 -10.1943 4.0180 0.0050 -0.0001 0.0031
hfenergy: -1242.7881803 hartree
pointgroup: C01 [X(C7H3Cl2N1)]
dipole: 0.9871507 0.0002643 -0.0002542 debye
dipolederiv: -0.2916182 -0.2940662 0.000009 -0.3041082 -0.6195338 0.0000189 0.0000048 0.0000012 -0.0446459 -0.2919659 0.2942577 -0.0000167 0.304296 -0.6191928 0.0000312 -0.0000257 0.000054 -0.0446506 -0.3336144 -0.0000687 -0.0002554 -0.0000377 -0.2018077 -0.0000012 -0.0000955 -0.0000009 -0.2295713 0.0855839 -0.0000744 0.0000282 -0.000095 0.353491 -0.000009 -0.0000249 -0.0000096 0.1383108 -0.2218761 0.2125004 -0.0000052 0.0718382 -0.2475392 0.0000127 -0.000072 0.0000108 -0.1141023 -0.2217218 -0.2124867 0.0000126 -0.0718102 -0.2476996 0.000001 -0.0000691 0.000006 -0.1141019 0.4728913 0.4944272 -0.0000021 0.5283945 0.9902904 -0.0000298 0.0000198 -0.0000008 -0.040504 0.4734808 -0.4947305 0.0000417 -0.5286967 0.9897062 -0.0000602 0.0000695 -0.000096 -0.0405028 -0.1649349 0.0001053 0.0000008 0.000099 -0.5164239 0.00002 -0.0000079 0.0000196 -0.0626717 0.282444 0.0001326 0.0002062 0.0001184 -0.083514 0.0000047 0.0002202 0.0000035 0.0251376 0.0858177 -0.0362659 -0.0000051 -0.0377845 0.0462476 0.0000087 -0.0000031 0.0000037 0.1776527 0.085773 0.0362886 -0.000008 0.0378061 0.0462908 0.0000009 -0.0000047 0.0000056 0.1776522 0.0397405 -0.0000195 -0.0000058 -0.0000199 0.109685 0.0000021 -0.0000112 0.0000027 0.1719972 unknown
polarizability: 137.1683618|0.0032099|121.5029644|-0.0053203|-0.0036007|36.0021376 unknown
InChI: InChI=1S/C7H3Cl2N/c8-6-1-5(4-10)2-7(9)3-6/h1-3H
charge 0 multiplicity 1
13 atoms
Cl 1.977368 2.773946 -0.000079
Cl 1.97897 -2.772825 0.000153
N  -3.679206 -0.000977 0.000455
C  -1.04349 -0.000309 -0.000122
C  -0.340402 -1.2363 -0.000025
C  -0.341114 1.236087 -0.000127
C  1.064167 1.206195 -0.000061
C  1.064861 -1.205593 0.000027
C  1.794528 0.000509 0.000014
C  -2.483822 -0.000724 -0.000211
H  -0.88408 -2.184075 -0.000009
H  -0.885341 2.183547 -0.000183
H  2.887061 0.00082 0.000068
