program: Gaussian 09
title: 000081219
version: EM64L-G09RevD.01
frameworkgroup: C1[X(C27H26P2)]
method: RPBEPBE
basis: SDD
operation: Freq
keyword: #pfreq=noraman
keyword: PBEPBE/SDD
title: #p freq=noraman PBEPBE/SDD
converged: YES YES NO NO
title: Mulliken charges:
elementType: P P C C C C C C C C C C C C C C C C C C C C C C C C C C C H H H H H H H H H H H H H H H H H H H H H H H H H H
charge: 0.621200 0.622016 -0.313631 -0.734823 -0.733952 -0.195295 -0.165821 -0.196605 -0.165621 -0.207186 -0.262873 -0.207675 -0.263355 -0.310228 -0.269370 -0.309804 -0.269556 -0.238048 -0.226594 -0.238248 -0.226761 -0.217272 -0.247239 -0.217311 -0.246805 -0.232172 -0.236273 -0.232178 -0.236591 0.228562 0.228829 0.240793 0.249343 0.249182 0.240466 0.257092 0.244890 0.257617 0.245521 0.246981 0.243845 0.247069 0.243201 0.227971 0.227896 0.228033 0.227914 0.228143 0.225441 0.228166 0.225428 0.229123 0.228703 0.229140 0.228721
chargesum: 0.00000
title: Mulliken charges with hydrogens summed into heavy atoms:
elementType: P P C C C C C C C C C C C C C C C C C C C C C C C C C C C
charge: 0.621200 0.622016 0.143760 -0.244686 -0.244304 -0.195295 -0.165821 -0.196605 -0.165621 0.049906 -0.017984 0.049942 -0.017834 -0.063248 -0.025524 -0.062735 -0.026355 -0.010077 0.001301 -0.010215 0.001153 0.010872 -0.021798 0.010854 -0.021377 -0.003048 -0.007570 -0.003038 -0.007870
polarizability: 3.68603233e+02 -3.34279600e-01 3.58155537e+02 2.60914790e+00 2.25146372e-01 2.78232737e+02
1716.lowfreq: -16.3399 -14.4817 -5.8255 -0.0020 -0.0012 -0.0009 3.8306 4.2554 5.4559
frequency: -15.2587 -13.5503 4.1987 19.9684 21.9815 30.6109 32.4848 37.7759 54.4258 58.4408 76.1767 112.6916 125.3749 149.6130 166.3100 183.7209 184.4984 203.5058 210.6009 238.3127 252.7591 257.5091 299.2083 328.5371 358.7182 382.9401 387.2583 393.2952 393.5522 398.6742 398.9598 414.9280 437.1407 479.7612 480.4285 506.5448 510.0936 612.2666 612.7298 613.3105 613.7292 642.2829 667.9307 671.7879 673.8670 675.7980 699.0441 699.3480 702.6008 702.9495 741.3785 741.7849 747.0295 752.4794 754.0564 757.2569 811.5580 849.8908 850.4041 857.2380 857.6830 913.4492 913.9391 927.6373 928.8470 972.5841 972.9281 973.9581 980.2829 980.5431 986.1225 986.5211 987.0485 987.0919 993.2318 993.3871 997.8997 997.9597 1017.1599 1017.3365 1018.5434 1020.0735 1020.6185 1059.8116 1073.1205 1073.8232 1076.6128 1077.2231 1078.9560 1079.1285 1084.2499 1084.7365 1091.8768 1171.6369 1171.7068 1172.5008 1172.7423 1185.3894 1188.3048 1188.4675 1195.4339 1199.9182 1241.1892 1255.3117 1303.8851 1304.1452 1305.7711 1312.1868 1313.5429 1338.5708 1368.8098 1368.9413 1372.2645 1372.3199 1420.7723 1420.8520 1423.4807 1423.5933 1436.2089 1442.2784 1462.7366 1462.8121 1469.4981 1469.7591 1479.9880 1579.7009 1579.8611 1582.6890 1582.7442 1591.6067 1591.7166 1595.2680 1595.5588 2977.8209 2979.3624 2989.8647 3030.4807 3051.2698 3067.3805 3118.3658 3118.4586 3118.6557 3118.7718 3122.1827 3122.3470 3124.1552 3124.3061 3134.1505 3134.3402 3138.0038 3138.1762 3144.7289 3144.8431 3148.1148 3148.4026 3161.4322 3161.4923 3162.7600 3162.8950
redmass: 3.7516 3.8753 5.5609 5.6094 4.9868 3.8170 4.1666 5.2422 5.0545 5.3202 5.6910 3.9307 6.3547 1.8271 3.2546 4.2785 4.5435 4.5885 3.8759 3.4665 5.0656 4.7620 4.9057 4.9006 5.1544 6.4270 5.8147 2.9148 2.8282 2.8627 2.9442 9.7671 6.6186 3.3676 3.3221 3.8800 3.9724 6.4376 6.4545 6.4331 6.4349 6.5908 6.4438 6.6798 6.5379 6.7565 1.9019 1.8968 1.9558 1.9611 1.2610 4.0592 1.5957 1.5577 1.6990 1.5435 1.3945 1.2513 1.2516 1.2448 1.2447 1.3756 1.3751 1.3665 1.3753 1.4035 1.3968 1.4119 1.4074 1.4103 6.0945 6.1472 5.9482 6.0125 1.3129 1.3132 1.3205 1.3205 3.5344 3.3820 4.8784 3.2854 3.6080 2.8930 1.6404 1.7541 2.0460 2.0676 1.9592 1.9319 2.3398 2.2838 1.0728 1.0542 1.0541 1.0554 1.0532 1.1831 1.1183 1.1260 1.1283 1.1459 1.2755 1.2918 1.2888 1.3551 1.1440 1.3650 1.3423 1.3765 6.0450 5.8848 7.2326 7.2376 2.1312 2.1269 2.1111 2.1237 1.1144 1.0956 2.0507 2.0508 1.9762 1.9552 1.0899 5.7041 5.7106 5.9463 5.9397 5.9302 5.9254 5.8686 5.8549 1.0577 1.0567 1.0573 1.1010 1.1054 1.1058 1.0855 1.0855 1.0848 1.0848 1.0876 1.0876 1.0869 1.0869 1.0918 1.0918 1.0919 1.0920 1.0963 1.0963 1.0954 1.0953 1.1016 1.1016 1.1015 1.1015
irintensity: 0.2415 0.2057 0.0723 0.0735 0.0117 0.0933 0.0819 0.0056 0.1221 0.1538 0.0166 1.0604 0.0897 0.1592 0.0068 0.1554 1.1675 0.0929 3.3557 0.1205 0.3611 0.0002 7.3154 3.9318 0.0037 3.4292 1.2925 0.9050 1.0736 0.1700 0.0879 4.1430 8.8988 42.5142 0.7950 0.9489 31.0417 0.6037 0.1260 0.0231 0.0210 19.8358 0.0206 0.6900 0.5619 0.6069 2.2335 92.7433 84.2724 4.0311 102.8723 3.9317 7.6084 47.0866 4.3615 56.0174 1.6016 0.4588 0.1155 0.0966 0.5252 0.7763 1.0157 3.0638 0.5071 4.4267 1.5902 19.2632 0.1016 0.2719 0.5824 3.5154 2.1021 2.0934 0.0509 0.0573 0.1910 0.0268 7.5776 8.3459 0.0081 10.9588 5.7383 3.3923 8.5038 2.9985 0.4929 5.1000 12.3882 6.4398 1.9626 1.6491 0.9104 0.0072 0.0095 0.3724 0.0381 9.1070 2.6597 7.7107 0.0751 0.0867 5.0137 3.9564 5.3426 3.5625 0.0979 4.4314 2.4327 7.5719 0.4515 0.0945 1.2306 0.9979 5.7209 20.8083 13.7373 0.7711 8.8545 12.1389 13.8088 14.5319 28.8836 12.8574 2.4230 1.1650 3.9775 0.1770 0.2160 4.4277 4.6452 21.4569 4.3453 5.0743 0.3427 33.7128 0.0003 0.0062 43.0797 3.7749 3.9766 2.2514 1.5027 0.0616 0.0263 0.1731 0.2157 7.0910 5.6900 12.3781 14.7367 23.4749 43.1858 43.8550 35.1243 44.6935 33.7409 31.4975 25.3984
temp: 298.150 k
press: 1.00000 atm
elementType: 15 15 6 6 6 6 6 6 6 6 6 6 6 6 6 6 6 6 6 6 6 6 6 6 6 6 6 6 6 1 1 1 1 1 1 1 1 1 1 1 1 1 1 1 1 1 1 1 1 1 1 1 1 1 1
symmnumber: 1
zpe: 1161711.7 jmol-1
zpe.correction: 0.442473 hartree
zpe.thermalcorrener: 0.468129 hartree
zpe.thermalcorrenthalpy: 0.469073 hartree
zpe.thermalcorrgfe: 0.381467 hartree
zpe.sumelectzpe: -1724.893991 hartree
zpe.sumelectthermal: -1724.868334 hartree
zpe.sumelectthermalent: -1724.867390 hartree
zpe.sumelectthermalfe: -1724.954997 hartree
dipole: 0.0120 1.2442 -0.0088
dipole: 1.2443
quadrupole: -175.4486 -166.3503 -185.2521
quadrupole: -0.0061 10.2561 0.0796
quadrupole: 0.2351 9.3333 -9.5684 -0.0061 10.2561 0.0796
hfenergy: -1725.3364631 hartree
pointgroup: C01 [X(C27H26P2)]
dipole: -0.0085101 -0.0017962 -0.4894722 debye
polarizability: 368.2976081|-5.8151672|278.5502369|-0.3300438|1.2314214|358.1436613 unknown
InChI: InChI=1S/C27H26P2/c1-5-14-24(15-6-1)28(25-16-7-2-8-17-25)22-13-23-29(26-18-9-3-10-19-26)27-20-11-4-12-21-27/h1-12,14-21H,13,22-23H2
charge 0 multiplicity 1
55 atoms
P  -2.622966 1.136529 0.482356
P  2.64072 -1.130399 0.462661
C  0.005541 -0.00229 0.262968
C  -1.176946 0.485444 -0.602215
C  1.173625 -0.50832 -0.611286
C  -3.223601 -0.514598 1.201776
C  -3.951653 1.437008 -0.83093
C  3.241591 0.536781 1.143295
C  3.950612 -1.447583 -0.865149
C  -3.875966 -1.50569 0.424783
C  -5.282726 1.665779 -0.387816
C  3.878322 1.516746 0.339717
C  5.293739 -1.641392 -0.442067
C  -2.978175 -0.766239 2.575636
C  -3.67294 1.535126 -2.21798
C  3.012595 0.812535 2.515385
C  3.646645 -1.593813 -2.242654
C  -4.271825 -2.728788 1.011742
C  -6.309464 1.96851 -1.308029
C  4.275147 2.752518 0.898779
C  6.306982 -1.957008 -1.372895
C  -3.370791 -1.992052 3.163771
C  -4.699673 1.848163 -3.140403
C  3.40593 2.051079 3.075582
C  4.660014 -1.919532 -3.175355
C  -4.018149 -2.975887 2.382172
C  -6.021135 2.064062 -2.690728
C  4.037807 3.023642 2.267597
C  5.993375 -2.100506 -2.745927
H  -0.333113 -0.815848 0.934169
H  0.355132 0.825483 0.910741
H  -0.848777 1.325774 -1.24374
H  -1.548532 -0.329084 -1.253647
H  1.530739 0.291146 -1.289032
H  0.836098 -1.364522 -1.226405
H  -4.087683 -1.315687 -0.634212
H  -5.517733 1.601492 0.681613
H  4.077023 1.308046 -0.718232
H  5.548952 -1.539496 0.619759
H  -2.485952 0.001087 3.185196
H  -2.658679 1.366582 -2.594769
H  2.532756 0.05397 3.145424
H  2.622655 -1.453237 -2.604275
H  -4.778186 -3.486188 0.402288
H  -7.330636 2.134633 -0.946371
H  4.769339 3.501155 0.268861
H  7.337583 -2.095589 -1.02671
H  -3.175084 -2.174252 4.22661
H  -4.464205 1.920183 -4.208593
H  3.222974 2.251928 4.137329
H  4.404721 -2.028803 -4.2358
H  -4.326334 -3.924589 2.836214
H  -6.816065 2.305185 -3.405338
H  4.346585 3.982202 2.70002
H  6.777988 -2.351492 -3.468484
