program: Gaussian 09
title: 000081039
version: EM64L-G09RevD.01
frameworkgroup: C1[X(C10H18O2)]
method: RPBEPBE
basis: SDD
operation: Freq
keyword: #pfreq=noraman
keyword: PBEPBE/SDD
title: #p freq=noraman PBEPBE/SDD
converged: YES YES NO NO
title: Mulliken charges:
elementType: O O C C C C C C C C C C H H H H H H H H H H H H H H H H H H
charge: -0.280984 -0.245549 -0.141111 -0.442503 -0.435461 -0.394143 -0.391735 -0.387583 0.201620 0.044620 -0.688633 -0.687810 0.235673 0.222621 0.206774 0.217183 0.208878 0.201542 0.191681 0.193304 0.202739 0.199934 0.193428 0.231576 0.207195 0.231842 0.222200 0.212109 0.253009 0.217586
chargesum: 0.00000
title: Mulliken charges with hydrogens summed into heavy atoms:
elementType: O O C C C C C C C C C C
charge: -0.280984 -0.245549 0.094561 -0.013107 -0.009400 -0.000920 0.004308 0.005778 0.201620 0.276196 -0.027397 -0.005106
polarizability: 1.38665641e+02 -1.65318056e+00 1.01102812e+02 -1.09870236e+00 1.79203398e+00 9.72389627e+01
1716.lowfreq: -0.0010 -0.0009 -0.0004 4.1860 13.4118 25.6259 27.5221 56.7139 76.4086
frequency: 26.6013 56.1377 76.2330 86.7542 153.3722 191.2833 208.7934 221.1358 240.3421 245.9608 282.3510 334.0245 367.8612 396.4634 429.0918 444.0919 478.1171 501.8117 678.5603 719.1081 766.1314 785.1318 792.8094 839.7894 881.4487 889.8982 894.3132 921.7488 925.7217 934.2045 943.7122 1009.3997 1051.9735 1053.9525 1072.2829 1093.9986 1111.8557 1118.4532 1148.9326 1158.1652 1182.7170 1183.6508 1241.0182 1256.4726 1261.9383 1295.0683 1302.4175 1321.2477 1327.5509 1335.4941 1336.3195 1342.5136 1347.2565 1358.4580 1379.3589 1396.4466 1457.5348 1461.3833 1462.3060 1464.6166 1465.7997 1471.0275 1472.2254 1478.6288 1486.6702 1627.1723 2965.1444 2968.2062 2969.2971 2976.2856 2987.9858 2989.1361 2991.8063 3002.0833 3025.4882 3027.8250 3028.8309 3037.7313 3045.8332 3055.8338 3082.6394 3091.5783 3097.2038 3102.6604
redmass: 3.4696 3.0766 3.7875 3.7414 3.1212 1.0326 1.9337 1.7288 2.6508 1.8025 3.1624 2.4922 2.1230 3.2581 2.9778 2.7481 2.7084 1.5949 5.9425 5.5773 3.5680 1.6591 2.0484 2.5028 1.7221 2.5313 1.5078 1.9847 1.2424 2.6439 1.4500 3.0267 1.8170 1.2699 1.3485 2.1797 2.1022 2.2140 2.3765 2.0518 1.6255 1.7691 1.3957 1.3032 1.2748 1.2515 1.2823 1.3537 1.3975 1.3724 1.3870 1.4791 1.5480 1.5997 1.2621 1.2358 1.0530 1.0859 1.0864 1.0853 1.0505 1.0812 1.0508 1.0924 1.0484 10.1437 1.0631 1.0592 1.0651 1.0620 1.0355 1.0618 1.0359 1.0828 1.0864 1.0982 1.0949 1.1023 1.1034 1.1023 1.0993 1.0987 1.1006 1.1005
irintensity: 0.5349 1.4167 0.3650 0.4603 2.7965 0.0987 3.3446 0.2108 0.0396 3.3391 4.5196 1.8081 0.7248 7.9389 0.2438 2.0594 1.5466 0.7813 6.0885 3.0514 5.4985 0.3263 0.5689 16.4572 1.2801 5.7731 12.8984 0.8208 2.4292 16.4796 1.1056 95.0951 6.2734 0.1834 17.1347 261.3164 12.1773 34.9276 71.0040 12.8744 10.3612 0.4239 30.3164 0.5119 1.2103 40.1489 27.9238 4.3161 3.2471 1.0048 2.4209 0.5187 4.6854 9.7795 33.9949 16.5702 5.9219 1.2430 10.1016 12.6043 2.1646 23.5764 5.8996 4.0789 20.2943 158.4442 37.0848 35.3914 34.6917 16.9454 15.9205 21.0784 24.7427 8.0995 7.3492 75.7575 62.3458 30.6788 17.2738 93.4323 5.6138 57.5950 20.4782 32.8137
temp: 298.150 k
press: 1.00000 atm
elementType: 8 8 6 6 6 6 6 6 6 6 6 6 1 1 1 1 1 1 1 1 1 1 1 1 1 1 1 1 1 1
symmnumber: 1
zpe: 691997.1 jmol-1
zpe.correction: 0.263568 hartree
zpe.thermalcorrener: 0.276799 hartree
zpe.thermalcorrenthalpy: 0.277743 hartree
zpe.thermalcorrgfe: 0.223239 hartree
zpe.sumelectzpe: -541.357119 hartree
zpe.sumelectthermal: -541.343888 hartree
zpe.sumelectthermalent: -541.342944 hartree
zpe.sumelectthermalfe: -541.397448 hartree
dipole: -0.3095 1.2443 1.3033
dipole: 1.8283
quadrupole: -64.1329 -75.4363 -77.4697
quadrupole: -0.7242 -0.6508 -3.6761
quadrupole: 8.2134 -3.0900 -5.1234 -0.7242 -0.6508 -3.6761
hfenergy: -541.6206868 hartree
pointgroup: C01 [X(C10H18O2)]
dipole: 0.1233031 0.5636445 -0.4295272 debye
polarizability: 138.5932314|2.5555941|101.6342847|0.4007361|-1.0755485|96.7798989 unknown
InChI: InChI=1S/C10H18O2/c1-8(2)12-10(11)9-6-4-3-5-7-9/h8-9H,3-7H2,1-2H3
charge 0 multiplicity 1
30 atoms
O  1.609436 0.21104 -0.437174
O  0.812388 -1.244727 1.206585
C  -0.772906 -0.07772 -0.299558
C  -1.787687 -1.240294 -0.168131
C  -1.286379 1.190634 0.454152
C  -3.188877 -0.818024 -0.668096
C  -2.685041 1.606891 -0.056592
C  -3.699424 0.445274 0.065554
C  0.592878 -0.462679 0.249992
C  3.021956 0.01335 0.057834
C  3.916321 0.295351 -1.151243
C  3.264775 0.951662 1.248843
H  -0.644901 0.192638 -1.366031
H  -1.838237 -1.547964 0.893961
H  -1.428057 -2.119946 -0.735666
H  -0.564512 2.018993 0.324542
H  -1.341104 0.962356 1.537911
H  -3.900928 -1.654451 -0.529917
H  -3.145359 -0.612378 -1.758107
H  -2.609283 1.917412 -1.119239
H  -3.040079 2.488985 0.510864
H  -4.683022 0.752321 -0.339626
H  -3.852487 0.207133 1.138518
H  3.102878 -1.040043 0.385715
H  4.977569 0.153614 -0.877121
H  3.676789 -0.386511 -1.98502
H  3.782355 1.334143 -1.501326
H  4.301784 0.837223 1.614627
H  2.579693 0.713078 2.079639
H  3.11616 2.004638 0.949608
