program: Gaussian 09
title: 000081049
version: EM64L-G09RevD.01
frameworkgroup: C1[X(C11H14N2O2)]
method: RPBEPBE
basis: SDD
operation: Freq
keyword: #p
keyword: freq=noraman
keyword: PBEPBE/SDD
title: #p freq=noraman PBEPBE/SDD
converged: NO YES NO NO
title: Mulliken charges:
elementType: O O N N C C C C C C C C C C C H H H H H H H H H H H H H H
charge: -0.238510 -0.238694 -0.164654 0.015242 -0.405058 -0.379148 -0.373927 -0.393405 -0.395869 0.498639 -0.347215 -0.347054 -0.383280 -0.382503 0.384393 0.229480 0.194781 0.208313 0.212032 0.213601 0.206029 0.212878 0.221615 0.221724 0.215923 0.227336 0.225038 0.281137 0.281157
chargesum: 0.00000
title: Mulliken charges with hydrogens summed into heavy atoms:
elementType: O O N N C C C C C C C C C C C
charge: -0.238510 -0.238694 -0.164654 0.015242 0.019202 0.041197 0.045703 0.041089 0.041778 0.498639 -0.119880 -0.122017 -0.102144 -0.101346 0.384393
polarizability: 2.75711030e+02 -1.13455470e+00 1.36683983e+02 9.19703544e+00 -3.80279755e+00 7.88174307e+01
1716.lowfreq: -26.2370 -19.5393 -4.1943 -0.0007 -0.0005 -0.0005 6.0410 47.6378 74.2752
frequency: -24.1294 47.2775 74.2690 85.4161 133.8974 198.0569 225.0821 251.9285 272.2609 308.3815 379.7790 418.6419 420.9278 428.8992 450.2111 493.1573 513.4935 523.1847 609.0894 626.2641 662.4824 702.8750 730.0472 786.2004 799.9906 805.0987 824.7927 833.0640 845.2851 908.9052 918.1563 945.4228 976.4937 981.2355 986.6676 1014.5927 1049.2034 1085.7258 1102.0730 1118.3304 1122.6789 1131.4835 1154.9642 1190.2339 1223.1137 1232.7493 1252.1527 1263.4253 1275.6530 1306.1292 1332.7913 1336.1760 1342.6873 1345.6894 1353.3915 1365.8672 1385.2008 1398.7404 1454.9120 1456.5202 1463.3930 1464.4130 1470.5923 1484.7212 1510.0553 1570.2273 1620.7502 2927.6357 2933.1340 2973.3303 2989.8803 2990.6266 3043.6732 3050.6800 3059.6124 3095.2271 3108.1938 3161.3280 3162.1798 3181.2100 3184.7400
redmass: 3.6318 4.1754 5.7360 5.6758 4.4984 2.9694 3.0291 5.3516 2.8634 4.0494 1.9077 3.3711 3.3450 3.2835 3.4914 2.9293 2.2075 5.4163 3.4243 6.8493 4.5859 5.3629 4.7111 4.6270 1.6596 1.3855 1.8734 2.2610 1.6168 2.4739 3.0799 1.3401 1.3245 1.3412 3.0636 2.4991 2.0538 1.4798 2.9935 2.4939 1.4597 2.1049 1.2366 1.6150 1.9495 2.2282 1.6668 1.3642 1.1801 1.3143 1.2634 2.4595 2.1437 1.4965 1.4599 1.3266 5.5835 2.2181 2.1660 1.4817 1.0948 1.0894 1.0938 1.1051 3.1343 7.4867 6.4233 1.0726 1.0710 1.0647 1.0610 1.0606 1.0962 1.1029 1.1035 1.0906 1.0894 1.0870 1.0872 1.0955 1.0966
irintensity: 0.4813 0.5105 1.5638 0.4022 1.3472 0.3184 2.7775 0.5439 2.8721 0.6993 4.8107 1.7201 0.7918 1.2548 2.1946 9.3931 1.3432 3.8729 13.9069 1.0190 24.2541 4.6698 3.4840 0.1414 1.5224 1.6198 55.9659 19.2404 18.3241 5.2758 45.2088 4.8723 6.2199 1.3679 1.1099 28.0998 7.6777 1.8226 11.3852 0.8289 18.6520 32.6635 12.8655 383.9998 18.6243 660.5418 39.5589 2.7480 12.0087 2.2233 3.1376 45.8105 47.2430 9.0969 8.3253 2.6994 27.8178 79.7537 2.1558 10.1728 33.7700 14.9229 8.4802 13.6476 102.6574 14.2430 429.1040 46.7161 97.2893 41.3473 29.6947 32.6130 67.9981 28.4548 80.5701 16.9419 12.0788 10.3322 5.0081 4.1276 9.9245
temp: 298.150 k
press: 1.00000 atm
elementType: 8 8 7 7 6 6 6 6 6 6 6 6 6 6 6 1 1 1 1 1 1 1 1 1 1 1 1 1 1
symmnumber: 1
zpe: 621502.0 jmol-1
zpe.correction: 0.236718 hartree
zpe.thermalcorrener: 0.248926 hartree
zpe.thermalcorrenthalpy: 0.249871 hartree
zpe.thermalcorrgfe: 0.197788 hartree
zpe.sumelectzpe: -686.323202 hartree
zpe.sumelectthermal: -686.310994 hartree
zpe.sumelectthermalent: -686.310049 hartree
zpe.sumelectthermalfe: -686.362132 hartree
dipole: -10.2336 0.1685 -0.7038
dipole: 10.2591
quadrupole: -115.2481 -82.9536 -89.5905
quadrupole: 0.3106 -0.8726 -0.1735
quadrupole: -19.3174 12.9771 6.3403 0.3106 -0.8726 -0.1735
hfenergy: -686.55992 hartree
pointgroup: C01 [X(C11H14N2O2)]
dipole: -4.012409 -0.1041775 0.4255194 debye
polarizability: 274.699046|2.4702571|136.9064|-16.6665623|1.4112581|79.6069974 unknown
InChI: InChI=1S/C11H14N2O2/c14-13(15)11-6-4-10(5-7-11)12-8-2-1-3-9-12/h4-7H,1-3,8-9H2
charge 0 multiplicity 1
29 atoms
O  4.545441 -1.06588 -0.388833
O  4.479964 1.220766 -0.378711
N  -1.769917 -0.102506 0.339356
N  3.901432 0.059578 -0.310368
C  -4.670172 0.07354 -0.146951
C  -3.819457 -1.098614 -0.683592
C  -3.794927 1.338056 0.004214
C  -2.562367 -1.34399 0.188404
C  -2.561072 1.029106 0.879482
C  -0.381861 -0.064529 0.197354
C  0.401048 -1.268796 0.129045
C  0.326526 1.183337 0.096361
C  1.79019 -1.229063 -0.038229
C  1.715027 1.224294 -0.067457
C  2.452347 0.017441 -0.137443
H  -5.523975 0.268622 -0.821626
H  -5.096162 -0.1980 0.841214
H  -4.414542 -2.031114 -0.71639
H  -3.494421 -0.876371 -1.718472
H  -3.460855 1.686408 -0.992169
H  -4.37187 2.159499 0.469905
H  -2.87061 -1.718011 1.190398
H  -1.947669 -2.122506 -0.287164
H  -1.92622 1.919018 0.990136
H  -2.908578 0.752352 1.900726
H  -0.074696 -2.245556 0.245059
H  -0.217332 2.131156 0.10818
H  2.381575 -2.14796 -0.076798
H  2.246255 2.175623 -0.158832
