program: Gaussian 09
title: 000081046
version: EM64L-G09RevD.01
frameworkgroup: C1[X(C14H10O3)]
method: RPBEPBE
basis: SDD
operation: Freq
keyword: #pfreq=noraman
keyword: PBEPBE/SDD
title: #p freq=noraman PBEPBE/SDD
converged: YES YES NO NO
title: Mulliken charges:
elementType: O O O C C C C C C C C C C C C C C H H H H H H H H H H
charge: -0.272802 -0.268312 -0.259704 0.049087 0.166633 0.200894 0.110549 0.182297 0.233811 -0.394610 -0.356844 -0.384120 -0.348428 -0.188840 -0.249248 -0.208228 -0.520786 0.266701 0.279627 0.260662 0.263181 0.237576 0.236271 0.236573 0.289495 0.209683 0.228884
chargesum: 0.00000
title: Mulliken charges with hydrogens summed into heavy atoms:
elementType: O O O C C C C C C C C C C C C C C
charge: -0.272802 -0.268312 -0.259704 0.049087 0.166633 0.200894 0.110549 0.182297 0.233811 -0.127909 -0.077217 -0.123459 -0.085246 0.048736 -0.012977 0.028345 0.207276
polarizability: 2.47015086e+02 6.34065059e+00 1.86247216e+02 -4.29766734e+00 4.44476519e+00 6.95249457e+01
1716.lowfreq: -9.3572 -1.8866 -0.0004 -0.0003 0.0006 4.4624 49.7330 73.0699 112.1927
frequency: 49.6943 73.0490 112.1905 133.8358 145.7894 193.0288 224.7317 245.5433 273.7952 299.5855 315.3940 356.6942 404.4201 428.4562 463.8370 488.8774 503.6685 520.8883 545.6645 583.8608 609.9745 639.4477 648.2345 665.0691 722.2144 755.4774 768.5049 791.7775 815.3907 830.6256 880.3855 889.4504 904.8278 913.3485 971.0887 977.7348 998.1800 1016.8484 1029.9696 1068.2274 1096.3853 1109.1156 1146.5340 1157.0999 1164.3335 1172.4070 1201.3208 1223.2358 1244.1514 1254.1605 1306.5891 1374.9848 1401.4985 1411.8304 1414.6425 1445.5922 1447.8263 1457.9155 1463.2015 1480.6341 1545.1942 1565.4498 1593.0415 1606.6096 1625.6566 2984.3189 3097.1711 3130.4596 3139.8233 3148.9088 3153.4729 3167.1457 3174.8465 3177.1260 3184.8273
redmass: 5.2914 4.5562 2.1745 3.4788 1.8768 5.1297 4.3879 3.7143 6.5560 4.2755 6.6211 6.0446 6.5272 3.6010 5.5275 5.7083 4.9853 3.7661 8.3834 7.5991 4.7692 6.3260 6.9691 3.7923 3.1560 5.6375 1.4792 1.7081 3.1376 6.8426 1.4823 1.4259 6.7090 8.6758 1.3669 1.3241 1.3312 3.6252 2.4844 1.9086 2.2253 1.2314 1.4437 1.6283 1.1553 1.3467 2.3234 3.1519 3.1690 2.0621 2.7233 7.4063 7.8702 1.8099 2.3713 1.1917 2.8367 1.6902 2.5885 1.0817 7.0401 6.8614 7.8769 7.2589 7.5427 1.0321 1.1000 1.1049 1.0862 1.0878 1.0901 1.0954 1.0924 1.0999 1.0989
irintensity: 2.3580 0.3422 6.7629 3.7579 0.0703 0.9324 3.4603 1.8217 1.2448 6.1292 2.1450 4.6103 2.7803 0.5720 1.2012 3.0558 13.2641 3.8307 2.6492 7.3087 1.6771 3.0358 10.5412 20.0958 8.3781 6.2084 54.0705 91.3350 22.0767 6.4310 0.6615 2.7734 23.5763 30.3117 2.6868 2.1338 0.4448 52.2089 62.7888 2.9963 19.1988 8.9709 3.0671 16.3126 0.1383 1.1293 3.8656 74.5673 64.8294 25.4611 169.5323 29.0841 7.1052 66.1177 7.1180 85.4832 122.2503 101.1825 9.1057 59.0072 95.4113 132.2432 101.5919 205.0073 17.2935 61.1541 36.8467 9.3776 4.1799 10.2168 5.5557 10.6869 3.6222 18.7021 6.2990
temp: 298.150 k
press: 1.00000 atm
elementType: 8 8 8 6 6 6 6 6 6 6 6 6 6 6 6 6 6 1 1 1 1 1 1 1 1 1 1
symmnumber: 1
zpe: 529510.8 jmol-1
zpe.correction: 0.201680 hartree
zpe.thermalcorrener: 0.215025 hartree
zpe.thermalcorrenthalpy: 0.215969 hartree
zpe.thermalcorrgfe: 0.161786 hartree
zpe.sumelectzpe: -763.977121 hartree
zpe.sumelectthermal: -763.963776 hartree
zpe.sumelectthermalent: -763.962832 hartree
zpe.sumelectthermalfe: -764.017015 hartree
dipole: -1.2586 1.7999 2.0254
dipole: 2.9877
quadrupole: -80.9866 -91.6454 -101.7692
quadrupole: 3.2718 2.6194 -4.7745
quadrupole: 10.4804 -0.1783 -10.3022 3.2718 2.6194 -4.7745
hfenergy: -764.1788011 hartree
pointgroup: C01 [X(C14H10O3)]
dipole: -0.4802938 0.7387326 0.7779762 debye
polarizability: 246.9240961|5.8458554|186.3475762|-6.9729655|0.2444149|69.5155753 unknown
InChI: InChI=1S/C14H10O3/c1-16-11-7-4-8-12-13(11)14(15)9-5-2-3-6-10(9)17-12/h2-8H,1H3
charge 0 multiplicity 1
27 atoms
O  -0.664188 1.785532 0.103363
O  3.102396 -1.505639 -0.02579
O  0.245918 -2.246244 -0.542932
C  1.069368 -0.000357 -0.054597
C  -1.38526 -0.557402 -0.05049
C  0.681019 1.382089 -0.007171
C  0.014483 -1.032205 -0.22468
C  -1.676891 0.817955 0.123474
C  2.490548 -0.257923 -0.083978
C  1.595075 2.447975 -0.08486
C  -2.468495 -1.476749 -0.066628
C  3.409578 0.812088 -0.201466
C  -2.997476 1.288586 0.290468
C  2.965428 2.149121 -0.212933
C  -3.789296 -1.029904 0.102564
C  -4.05144 0.356675 0.282798
C  2.629324 -2.553637 0.903221
H  1.21968 3.473637 -0.052679
H  -2.229603 -2.534549 -0.216458
H  4.472971 0.562014 -0.246129
H  -3.172475 2.360787 0.416516
H  3.694677 2.962116 -0.288989
H  -4.617968 -1.745055 0.094485
H  -5.081281 0.706324 0.41247
H  1.870777 -3.176059 0.406703
H  2.202819 -2.09933 1.817275
H  3.53371 -3.130744 1.152543
