program: Orca
programVersion: 6.1.1
elementType: Fe N C H C C C H C C C H C C H C H C C C C H C H C H H C H H H H H H
charge: 0
multiplicity: 5
keywords: TPSSh D4 def2-TZVP def2/J NormalPrint SurfCrossNumFreq
frequency: 0.00 0.00 0.00 0.00 0.00 0.00 0.00 -62.86 -55.01 -5.09 146.43 164.71 168.77 195.30 202.29 224.01 238.88 280.85 294.93 318.12 351.17 371.99 374.33 447.41 528.26 578.50 586.76 619.18 622.23 633.79 644.99 726.49 735.36 736.62 737.86 744.86 748.05 750.26 778.14 780.69 810.58 821.18 846.47 853.16 858.81 881.19 891.89 919.69 937.06 943.50 945.51 968.63 996.71 1008.78 1027.69 1033.42 1043.52 1049.59 1065.11 1070.77 1107.84 1163.03 1166.77 1178.92 1197.82 1235.68 1240.73 1244.36 1266.04 1266.47 1294.74 1316.83 1359.20 1371.39 1373.14 1383.19 1390.95 1431.34 1442.52 1446.80 1465.32 1475.68 1486.88 1513.31 1514.51 1622.41 1627.70 3016.17 3019.55 3048.28 3050.20 3162.48 3171.03 3184.09 3205.69 3207.06 3209.44 3210.84 3224.05 3225.51 3235.63 3238.39
frequency: 146.43 164.71 168.77 195.30 202.29 224.01 238.88 280.85 294.93 318.12 351.17 371.99 374.33 447.41 528.26 578.50 586.76 619.18 622.23 633.79 644.99 726.49 735.36 736.62 737.86 744.86 748.05 750.26 778.14 780.69 810.58 821.18 846.47 853.16 858.81 881.19 891.89 919.69 937.06 943.50 945.51 968.63 996.71 1008.78 1027.69 1033.42 1043.52 1049.59 1065.11 1070.77 1107.84 1163.03 1166.77 1178.92 1197.82 1235.68 1240.73 1244.36 1266.04 1266.47 1294.74 1316.83 1359.20 1371.39 1373.14 1383.19 1390.95 1431.34 1442.52 1446.80 1465.32 1475.68 1486.88 1513.31 1514.51 1622.41 1627.70 3016.17 3019.55 3048.28 3050.20 3162.48 3171.03 3184.09 3205.69 3207.06 3209.44 3210.84 3224.05 3225.51 3235.63 3238.39
formula: C17H15FeN
InChI: InChI=1/C17H15N.Fe/c1-2-7-14(6-1)12-16-10-5-11-17(18-16)13-15-8-3-4-9-15;/h1-11H,12-13H2;/rC17H15FeN/c1-2-6-4-8-10-14-15-11(8)18(10,14,15)12-9(5-7(3-1)19-6)13(18)17(18)16(12)18/h1-3,10-17H,4-5H2
34 atoms
Fe 0.03785 0.008435 -0.212279
N  -0.287833 0.458625 2.249294
C  -0.449003 -2.15729 0.240483
H  0.206222 -2.807797 0.802118
C  0.517343 2.209316 -0.463042
C  1.386702 1.784081 0.571183
C  -0.374352 -1.902016 -1.158948
H  0.333238 -2.338869 -1.847037
C  -1.550276 -1.437568 0.767801
C  0.429193 1.405642 2.859925
C  -1.269457 -0.13862 4.338986
H  -1.954127 -0.773617 4.88985
C  -2.114479 -0.680286 -0.288603
C  1.835104 0.527991 -1.308853
H  2.290828 -0.182263 -1.98171
C  2.168363 0.716051 0.063058
H  2.91068 0.158899 0.616748
C  -1.408674 -0.984896 -1.488267
C  0.808378 1.454639 -1.635679
C  -0.523345 0.838887 4.981562
C  -1.125311 -0.298497 2.963398
H  -0.611344 0.984472 6.05234
C  0.338883 1.626188 4.231739
H  0.938282 2.40065 4.696904
C  -1.924913 -1.342907 2.207544
H  -1.790588 -2.309052 2.705204
H  -2.987795 -1.095747 2.30492
C  1.348459 2.241991 1.989457
H  2.352017 2.222591 2.427237
H  1.013884 3.28387 2.040546
H  -0.222519 2.992882 -0.38156
H  -2.955821 -0.007603 -0.201506
H  0.343748 1.576713 -2.602116
H  -1.630244 -0.598977 -2.471486
totalener: -1975.66367545118374 hartree
nucrepener: 1834.72434283949201 hartree
electener: -3810.38801485973590 hartree
oneelecener: -6359.68430586020077 hartree
twoeener: 2549.29629100046486 hartree
kineticenergy: 1970.50404529355046 hartree
exchangeener: -140.123423671639 hartree
correlationener: -5.368195918224 hartree
xcener: -145.491619589863 hartree
s2: 6.019920
energy: -6961.2422 -812.6249 -699.4879 -699.0787 -698.9975 -388.1540 -276.5627 -276.5623 -275.9438 -275.5916 -275.5910 -275.4735 -275.4732 -274.9880 -274.9855 -274.7699 -274.7675 -274.7587 -274.7559 -274.7212 -274.7182 -274.7124 -274.7094 -93.8080 -61.2769 -60.1805 -60.0385 -25.6168 -23.1064 -22.9864 -21.6345 -21.5277 -20.1554 -19.2620 -18.3165 -18.3147 -17.8701 -17.4441 -16.3282 -16.2230 -14.1754 -13.9864 -13.8422 -13.7607 -13.7286 -13.4277 -13.0010 -12.2767 -12.0417 -11.8691 -11.3539 -11.2417 -11.1272 -10.2483 -10.2008 -10.1388 -10.0728 -9.8748 -9.8397 -9.7722 -9.4219 -9.2260 -9.0989 -9.0380 -8.9312 -8.0365 -8.0148 -7.9530 -7.8212 -7.3613 -6.9083 -6.7712 -6.5252 -5.9086 -5.3458 -3.7975 -3.7593 -1.3726 -1.0927 0.6926 0.7543 1.0648 1.0864 1.3252 1.6285 1.6401 1.7536 1.9784 electronvolt
energy: -6961.2159 -810.9104 -697.8411 -697.7327 -697.6672 -388.1170 -276.5603 -276.5600 -275.9459 -275.5898 -275.5892 -275.4770 -275.4766 -274.9359 -274.9331 -274.7445 -274.7425 -274.7337 -274.7309 -274.6984 -274.6950 -274.6893 -274.6867 -89.4098 -56.0037 -55.9949 -55.8781 -25.5831 -23.0084 -22.8992 -21.6246 -21.5076 -20.1117 -19.2089 -18.2416 -18.2206 -17.8068 -17.3814 -16.3031 -16.1993 -14.1235 -13.9376 -13.8001 -13.7052 -13.6410 -13.3957 -12.9261 -12.2312 -11.9946 -11.8568 -11.3397 -11.1592 -11.0895 -10.1915 -10.0046 -9.9075 -9.8891 -9.8447 -9.7208 -9.6774 -9.3017 -9.1691 -8.9963 -8.9542 -8.8870 -7.9376 -7.3992 -6.7821 -6.1642 -5.9800 -5.9114 -5.7942 -4.4656 -1.7204 -1.3540 -1.1080 -0.9819 -0.2487 -0.2251 0.7551 1.1711 1.1898 1.4102 1.6268 electronvolt
chargesum: 0.0000000
charge: 0.543097 -0.210364 -0.201238 0.087826 -0.206461 0.186785 -0.178448 0.094638 0.186247 0.163673 -0.240935 0.109398 -0.207399 -0.179083 0.094804 -0.203216 0.087814 -0.178039 -0.179697 -0.027260 0.164147 0.116207 -0.240982 0.109521 -0.254244 0.116127 0.108004 -0.253079 0.115872 0.107873 0.089134 0.089622 0.094949 0.094705
charge: 0.142945 0.257277 -0.141487 0.140062 -0.142024 -0.162724 -0.161043 0.140437 -0.162882 -0.177382 -0.118989 0.147509 -0.142287 -0.161218 0.140571 -0.141933 0.140124 -0.161376 -0.161610 -0.114486 -0.177278 0.145746 -0.118959 0.147500 -0.169781 0.154863 0.156243 -0.169721 0.154876 0.156096 0.139933 0.140076 0.140434 0.140489
qa: 0.5431 -0.2104 -0.2012 0.0878 -0.2065 0.1868 -0.1784 0.0946 0.1862 0.1637 -0.2409 0.1094 -0.2074 -0.1791 0.0948 -0.2032 0.0878 -0.1780 -0.1797 -0.0273 0.1641 0.1162 -0.2410 0.1095 -0.2542 0.1161 0.1080 -0.2531 0.1159 0.1079 0.0891 0.0896 0.0949 0.0947
va: 5.9748 3.0985 3.8311 0.9864 3.8500 3.5246 3.8255 0.9890 3.5251 3.9715 3.9813 0.9748 3.8523 3.8254 0.9892 3.8313 0.9865 3.8239 3.8235 3.9039 3.9708 0.9642 3.9810 0.9747 4.0408 0.9623 0.9651 4.0420 0.9624 0.9652 0.9860 0.9860 0.9889 0.9892
dispersion: -0.063804548 hartree
energy: -1975.727479999376 hartree
dipole: -0.826918001 0.650590200 -0.176327801 1.200473034 -0.954791357 0.245681677 7.212620815 -5.799941554 1.412679262
dipolemethod: SCF
magnitude: 1.444684629 au
magnitude: 3.672096499 debye
temp: 298.15 k
press: 1.00 atm
zeropoint: 0.26813227 hartree
thermalvibcorrection: 0.00979329 hartree
thermalrotcorrection: 0.00141627 hartree
thermaltrasncorrection: 0.00141627 hartree
thermaltotal: -1975.44672189 hartree
thermalcorr: 0.01262583 hartree
nonthermalcorr: 0.26813227 hartree
totalcorr: 0.28075810 hartree
thermalcorrenthalpy: 0.00094421 hartree
totalenthalpy: -1975.44577768 hartree
vibrat: 0.01549174 hartree
rotat: 0.01561337 hartree
transl: 0.02037507 hartree
total: 0.05299979 hartree
totalentropycorr: -0.05299979 hartree
gibbsenthalpy: -1975.49877747 hartree
gibbsminuselec: 0.22870252 hartree
