program: Gaussian 09
title: 000080977
version: EM64L-G09RevD.01
frameworkgroup: C1[X(C14H9ClN2)]
method: RPBEPBE
basis: SDD
operation: Freq
keyword: #p
keyword: freq=noraman
keyword: PBEPBE/SDD
title: #p freq=noraman PBEPBE/SDD
converged: NO YES NO NO
title: Mulliken charges:
elementType: Cl N N C C C C C C C C C C C C C C H H H H H H H H H
charge: -0.033170 -0.030870 0.057239 0.408274 0.071008 -0.153921 0.315489 -0.323284 -0.390967 -0.332477 -0.357914 -0.345583 -0.232636 -0.209285 -0.227281 -0.228492 -0.229822 0.259086 0.267832 0.273103 0.278590 0.237337 0.238561 0.228715 0.229899 0.230567
chargesum: 0.00000
title: Mulliken charges with hydrogens summed into heavy atoms:
elementType: Cl N N C C C C C C C C C C C C C C
charge: -0.033170 -0.030870 0.057239 0.408274 0.071008 -0.153921 0.315489 -0.064198 -0.390967 -0.064645 -0.084811 -0.066993 0.004701 0.029277 0.001434 0.001407 0.000745
polarizability: 3.18989631e+02 -1.34206344e+01 1.96064567e+02 1.78989407e-02 -1.70865413e-02 6.34561918e+01
1716.lowfreq: -7.1192 -2.9831 -0.0011 0.0015 0.0017 5.4412 44.7527 54.5216 100.7612
frequency: 44.7517 54.5188 100.7591 102.4433 168.9244 192.5432 211.6427 278.3708 291.9500 299.7609 379.9508 405.2161 422.6595 463.0796 499.8820 535.6093 549.8129 563.7904 614.8112 615.8956 648.4567 696.2028 711.6776 719.1057 778.3898 779.5687 795.4339 815.9501 840.6382 865.3555 888.1103 939.3473 957.3333 973.1683 989.5523 1000.0927 1002.4449 1009.9075 1016.5866 1020.4043 1060.5361 1081.2467 1127.3568 1168.6009 1172.4034 1180.9437 1224.2009 1245.6360 1282.9656 1308.4206 1318.8824 1369.6870 1381.8305 1394.8073 1434.3838 1443.6054 1468.5701 1493.1377 1528.6142 1559.2622 1587.5736 1609.2281 1623.6662 3128.1382 3139.7359 3141.2518 3153.3040 3156.0557 3168.6664 3168.6977 3175.1473 3178.0259
redmass: 4.1761 5.1584 5.9318 5.5536 5.2612 9.4491 8.2167 7.6000 5.3673 6.6285 7.9320 2.8630 3.5033 3.6338 8.3145 3.5260 8.0172 8.1768 6.4549 5.1916 7.0181 2.9902 1.9861 6.8236 1.5102 2.0627 9.1514 3.1481 6.8332 1.2457 1.6014 7.8995 1.4357 1.3621 6.2601 1.3757 1.3363 1.3322 2.7199 2.2333 2.8494 1.6305 1.6483 1.1358 1.0559 1.1190 3.7805 2.0896 3.6590 2.1650 1.6594 4.6343 4.8539 6.7728 2.6134 2.4703 3.2775 3.1659 7.0317 7.8703 6.4261 6.0924 6.8504 1.0853 1.0863 1.0895 1.0898 1.0943 1.0954 1.0952 1.0990 1.0999
irintensity: 0.5151 2.0099 0.9952 0.0128 0.0694 0.3835 0.1994 4.7003 0.5433 4.3057 7.6887 0.0002 0.7703 1.9999 5.3655 10.8371 8.7837 6.7060 0.3711 0.5651 26.7224 10.3179 73.9744 11.5917 27.9878 86.4673 60.9018 10.1433 0.1575 0.0006 0.1983 44.7155 5.3748 2.3013 0.9084 0.0004 0.0812 0.9476 1.8915 22.3261 0.4096 12.5734 1.2898 6.5603 0.0632 35.9735 21.3573 48.8556 4.8155 118.0981 71.5578 85.6762 13.8548 27.6142 79.7963 36.0499 60.3126 15.4528 246.0674 178.2818 7.5364 22.1649 16.2061 0.0350 3.5059 15.5748 6.9102 27.5858 3.9035 15.7884 22.9801 19.0763
temp: 298.150 k
press: 1.00000 atm
elementType: 17 7 7 6 6 6 6 6 6 6 6 6 6 6 6 6 6 1 1 1 1 1 1 1 1 1
symmnumber: 1
zpe: 500748.9 jmol-1
zpe.correction: 0.190725 hartree
zpe.thermalcorrener: 0.203568 hartree
zpe.thermalcorrenthalpy: 0.204512 hartree
zpe.thermalcorrgfe: 0.150243 hartree
zpe.sumelectzpe: -1107.321102 hartree
zpe.sumelectthermal: -1107.308259 hartree
zpe.sumelectthermalent: -1107.307314 hartree
zpe.sumelectthermalfe: -1107.361584 hartree
dipole: 1.3641 -2.2160 0.0023
dipole: 2.6022
quadrupole: -79.1450 -100.0898 -109.9416
quadrupole: -5.6420 0.0037 -0.0151
quadrupole: 17.2471 -3.6977 -13.5495 -5.6420 0.0037 -0.0151
hfenergy: -1107.5118268 hartree
pointgroup: C01 [X(C14H9Cl1N2)]
dipole: -0.6048686 0.8220498 0.0807345 debye
dipolederiv: -0.2688287 -0.3091334 -0.0310898 -0.3771228 -0.9551722 -0.0856045 -0.0372098 -0.0842071 -0.109619 -1.1179219 -0.0623096 -0.009432 0.3672782 -0.451254 -0.0231847 0.0325901 -0.0244163 -0.2051985 -1.3874132 -0.586602 -0.0616925 -0.454916 -0.5875274 -0.0468461 -0.0496552 -0.0469741 -0.1357638 -0.2581817 0.0058529 -0.000721 0.0920456 -0.6920482 -0.0784494 0.0081592 -0.0785843 0.093522 0.7031259 0.1561798 0.0175785 -0.3333631 0.2505809 0.0169995 -0.030318 0.0179111 0.0724693 1.9385584 0.2527464 0.0318056 0.2908873 0.5058382 0.0433403 0.0362939 0.0432278 0.0804729 -0.5857654 -0.0253229 -0.0046797 -0.1083332 -0.044635 -0.0042435 -0.0130206 -0.0040744 -0.0069305 -0.0021209 -0.0959968 -0.0092215 0.1421013 0.0913084 0.0218534 0.0144372 0.0212438 -0.1226017 1.1110914 0.5598895 0.0582804 0.3691176 1.6401488 0.1592164 0.0389189 0.1587566 0.0587003 -0.3117609 0.0409503 0.0035292 0.1470261 0.0717287 0.0232224 0.0140685 0.0230619 -0.1563363 0.0504778 -0.101066 -0.0094987 0.1944958 -0.0195415 0.0112229 0.0199348 0.0100737 -0.1219275 0.074121 0.1095003 0.0120046 -0.1698595 0.0021321 0.0122865 -0.015946 0.0134272 -0.1219076 0.0588022 0.0942164 0.0094705 0.0408208 -0.1801982 -0.0030654 0.004112 -0.0028896 -0.1491766 0.077869 -0.0449497 -0.0038858 -0.1170029 0.1990615 0.0316603 -0.0109034 0.0317644 -0.1217121 -0.2139441 0.1365171 0.0136332 0.2358717 0.0989359 0.0267959 0.0236456 0.0264266 -0.1550439 -0.0907015 -0.1774955 -0.0176143 -0.2879646 0.0281718 0.017603 -0.0287349 0.0177888 -0.1547519 0.0697389 0.0115893 0.002064 -0.0167826 0.0218001 0.0168319 -0.0009788 0.0170131 -0.143876 0.0728349 -0.0109503 -0.0012684 -0.0832668 0.0024844 -0.0158419 -0.0083712 -0.0157348 0.1586415 0.076989 -0.0768067 -0.0078236 -0.0271247 -0.0179566 -0.017771 -0.0030545 -0.0179463 0.1592366 0.1138463 0.0917348 0.0091264 0.0742425 0.0255973 -0.0124291 0.0075195 -0.0122726 0.1495296 0.1579303 -0.0511002 -0.0053318 -0.0593449 -0.0016878 -0.0158424 -0.0062375 -0.0158489 0.1500114 -0.1188833 -0.0103971 -0.0015923 -0.0177756 0.0860714 -0.0073425 -0.0022424 -0.0072784 0.1596193 0.0059515 0.1017362 0.0096731 0.1131848 -0.0353854 -0.018653 0.0108993 -0.0187344 0.1546177 0.0186211 -0.0719421 -0.0077871 -0.1139723 -0.0865827 -0.0250457 -0.0120011 -0.0249106 0.154512 -0.0243919 0.0887738 0.0082626 0.1283083 -0.0438544 -0.0198875 0.0121779 -0.0200399 0.1557381 -0.1500442 -0.0256146 -0.0037895 -0.0285511 0.0919839 -0.0068258 -0.0040835 -0.0067837 0.1577746 unknown
polarizability: 320.3420893|-3.4854642|193.4207204|0.4859587|12.9415541|64.7475796 unknown
InChI: InChI=1S/C14H9ClN2/c15-13-11-8-4-5-9-12(11)16-14(17-13)10-6-2-1-3-7-10/h1-9H
charge 0 multiplicity 1
26 atoms
Cl -1.842052 -3.288815 -0.375226
N  -0.223876 1.008122 0.054469
N  0.07276 -1.389185 -0.182466
C  -2.193612 -0.497469 -0.100396
C  -1.596619 0.821199 0.03191
C  0.566164 -0.080403 -0.051022
C  2.037857 0.076885 -0.029416
C  -3.610956 -0.64155 -0.11728
C  -1.229073 -1.557832 -0.2039
C  -2.457269 1.95684 0.142204
C  2.614818 1.369556 0.103585
C  2.883957 -1.059357 -0.141054
C  -4.425709 0.490292 -0.00711
C  -3.845453 1.791403 0.122557
C  4.015203 1.520196 0.124386
C  4.285111 -0.902926 -0.119439
C  4.855439 0.385274 0.013144
H  -4.043234 -1.641789 -0.217342
H  -1.991854 2.941665 0.240934
H  1.948039 2.23274 0.188312
H  2.424787 -2.046828 -0.243531
H  -5.515372 0.383487 -0.019681
H  -4.499886 2.665587 0.207349
H  4.454971 2.518357 0.226936
H  4.932727 -1.782188 -0.205658
H  5.944631 0.504939 0.029536
