program: Gaussian 09
title: 000080943
version: EM64L-G09RevD.01
frameworkgroup: C1[X(C13H7ClOS)]
method: RPBEPBE
basis: SDD
operation: Freq
keyword: #p
keyword: freq=noraman
keyword: PBEPBE/SDD
title: #p freq=noraman PBEPBE/SDD
converged: YES YES YES YES
title: Mulliken charges:
elementType: Cl S O C C C C C C C C C C C C C H H H H H H H
charge: -0.035402 0.219543 -0.250487 0.413025 0.385833 -0.310668 -0.312264 0.060712 -0.324878 -0.331528 -0.271968 -0.289811 -0.236536 -0.099156 -0.241791 -0.218384 0.291865 0.287393 0.272819 0.248143 0.264824 0.239821 0.238897
chargesum: 0.00000
title: Mulliken charges with hydrogens summed into heavy atoms:
elementType: Cl S O C C C C C C C C C C C C C
charge: -0.035402 0.219543 -0.250487 0.413025 0.385833 -0.310668 -0.312264 0.060712 -0.033013 -0.044136 0.000850 -0.041668 0.028288 -0.099156 -0.001970 0.020513
polarizability: 2.95134590e+02 -1.78909902e+00 1.75610144e+02 3.08921960e-03 2.09883362e-03 6.08435626e+01
1716.lowfreq: 0.0003 0.0018 0.0021 1.7853 2.7833 4.1387 36.2241 83.5448 118.3132
frequency: 36.2232 83.5406 118.3120 146.1504 169.6707 205.1368 250.4740 279.1158 283.9110 351.0777 383.0823 418.1285 421.9843 446.4463 447.8162 491.6674 495.4929 541.6062 599.3367 638.7323 659.6953 662.7392 721.1092 722.9266 757.7729 780.7003 798.6195 849.3163 866.3095 887.0115 912.7919 977.3676 996.7697 1009.7265 1028.0673 1051.6610 1053.1536 1084.2509 1115.9903 1134.1467 1165.6285 1175.0652 1233.9349 1259.8980 1296.6698 1365.8221 1385.5713 1390.9698 1424.0395 1450.3556 1456.3085 1524.4159 1552.1328 1577.7176 1590.5022 1605.7184 3134.6298 3146.1500 3157.5495 3158.8272 3161.7460 3172.4586 3181.4077
redmass: 9.9224 6.7604 5.0556 10.9069 5.9010 6.2533 8.8708 6.3517 8.3114 7.0743 9.2397 3.4774 13.8684 3.1391 11.4220 3.9973 8.6580 5.5026 7.4627 6.9702 3.9014 7.1223 4.1242 8.0377 1.5338 8.0682 2.0583 1.6355 1.4379 1.4453 7.1333 1.3700 1.3457 1.3497 3.6331 3.1454 3.1660 2.9143 1.7617 1.6862 2.1494 1.0830 1.5167 1.4289 2.4840 4.0497 9.4678 7.8071 2.3022 2.5780 2.3344 11.1177 7.8940 7.7098 6.8245 6.3949 1.0865 1.0897 1.0891 1.0942 1.0928 1.1007 1.0967
irintensity: 1.2740 2.6748 0.8068 0.6995 0.2064 0.3201 1.7632 0.2276 5.8948 10.2977 4.2995 6.0445 0.2662 0.3006 0.2194 7.3650 21.4783 1.5254 6.0187 1.4263 25.6893 1.3505 0.1718 16.7658 89.5921 43.5943 0.5913 34.4593 16.0421 1.6560 43.3469 1.9488 1.5521 1.0768 20.1714 8.6197 9.3385 45.1739 5.5972 9.6423 21.8678 2.0017 0.0703 4.5102 134.4522 48.3783 16.2463 47.5347 79.7862 29.8680 2.6129 139.2490 27.9007 98.4308 220.6398 2.9119 0.8278 7.6843 2.4437 4.1006 0.0750 29.5817 2.3187
temp: 298.150 k
press: 1.00000 atm
elementType: 17 16 8 6 6 6 6 6 6 6 6 6 6 6 6 6 1 1 1 1 1 1 1
symmnumber: 1
zpe: 415376.6 jmol-1
zpe.correction: 0.158209 hartree
zpe.thermalcorrener: 0.170683 hartree
zpe.thermalcorrenthalpy: 0.171627 hartree
zpe.thermalcorrgfe: 0.118484 hartree
zpe.sumelectzpe: -1431.862623 hartree
zpe.sumelectthermal: -1431.850149 hartree
zpe.sumelectthermalent: -1431.849205 hartree
zpe.sumelectthermalfe: -1431.902348 hartree
dipole: 1.8405 -2.2192 0.0014
dipole: 2.8831
quadrupole: -92.5676 -105.3439 -110.3642
quadrupole: -8.0968 0.0032 0.0040
quadrupole: 10.1910 -2.5853 -7.6056 -8.0968 0.0032 0.0040
hfenergy: -1432.0208316 hartree
pointgroup: C01 [X(C13H7Cl1O1S1)]
dipole: -0.7632316 0.8390742 -0.0088637 debye
dipolederiv: -0.9407913 -0.2127881 0.0116311 -0.3204732 -0.201032 0.0055112 0.0136674 0.0045959 -0.0563266 -0.6580836 0.0223217 0.0057035 0.049828 -0.1711163 0.003763 0.0051933 0.0037642 0.0466586 -0.6540678 -0.0468929 0.0036783 -0.0858136 -1.1048275 0.0154066 0.0044364 0.0150539 -0.3321751 -0.7961592 -0.2603473 0.0118592 -0.0419882 -0.3348498 0.0067816 0.0078922 0.0086565 0.0036128 -0.6318787 0.2738977 0.0003835 0.1448833 -0.3534021 0.0057016 0.0026963 0.0045699 0.013515 0.8307303 -0.4153808 0.0002687 -0.231816 0.2958032 -0.0043867 -0.0032301 -0.0026561 -0.0431361 0.8140842 0.3650297 -0.0143673 0.1749578 0.1389154 -0.0050196 -0.0107368 -0.0065573 -0.0450358 1.506577 0.0192281 -0.0121021 0.0339958 1.1604127 -0.0193899 -0.0124153 -0.0193162 0.151199 0.2718344 0.1826487 -0.0064895 -0.164193 0.0282487 -0.0007156 0.0001554 -0.0036291 -0.0796598 0.0805775 -0.1696416 0.0017339 0.0993004 0.0466029 -0.0035508 -0.0034079 -0.0011516 -0.091393 -0.8383717 0.1363586 0.0038263 0.128698 -0.0426767 -0.0021236 0.0038553 -0.0021724 -0.0936216 -0.5391138 -0.1199866 0.0057597 -0.1121267 0.1092078 -0.0037367 0.0056747 -0.0036518 -0.1375236 -0.3803776 -0.2952544 0.0078552 -0.2182885 -0.229581 0.00381 0.0064144 0.0044458 -0.1265786 1.43943 0.2858042 -0.0181335 0.3528767 0.5045484 -0.013572 -0.0194247 -0.0130262 -0.0470876 0.0180729 0.2181564 -0.0058343 0.1085969 -0.1777786 -0.0007663 -0.003801 -0.0017381 -0.1674046 0.1697412 -0.0079651 -0.0024308 0.0479913 0.1953849 -0.0065291 -0.0034421 -0.0060814 -0.1242314 0.1230956 -0.0509425 0.0012498 0.0333889 0.0326921 0.0020559 -0.0004082 0.0027593 0.1539335 0.1359101 0.0305467 -0.0004259 -0.0491415 0.0165401 0.0030845 0.0011102 0.0023638 0.154351 0.1101605 0.0176586 0.0001428 -0.0204905 -0.0008503 0.0034275 0.0008586 0.0030968 0.1677748 0.1054815 -0.049994 0.0014614 0.0102953 -0.0592081 0.0041465 0.0003183 0.0046836 0.1623242 -0.004045 0.065182 0.0002085 0.0556807 0.0571721 0.0016917 0.000367 0.0016304 0.16936 -0.0862794 -0.0750535 0.0036411 -0.0892524 0.0454089 0.0030508 0.0039511 0.0029421 0.1631644 -0.076527 0.0874144 0.0003803 0.0930905 0.0443851 0.0013595 0.0002754 0.001418 0.1582805 unknown
polarizability: 295.0308246|3.6357442|175.6533735|-2.0929125|-2.2234594|60.9040985 unknown
InChI: InChI=1S/C13H7ClOS/c14-8-5-6-10-12(7-8)16-11-4-2-1-3-9(11)13(10)15/h1-7H
charge 0 multiplicity 1
23 atoms
Cl 5.230928 1.02343 -0.032723
S  -0.17658 1.99039 -0.004937
O  -0.544482 -2.568023 0.084924
C  0.904723 -0.658017 0.036163
C  -1.675079 -0.450131 0.054648
C  1.141705 0.744176 0.007088
C  -1.68244 0.971375 0.02741
C  -0.444837 -1.295799 0.060108
C  2.034753 -1.527243 0.043304
C  -2.930708 -1.125736 0.078676
C  2.462703 1.262224 -0.013904
C  -2.903531 1.693078 0.024505
C  3.347768 -1.038185 0.022738
C  3.537332 0.363204 -0.005708
C  -4.141918 -0.41954 0.075757
C  -4.126947 0.999939 0.048468
H  1.830973 -2.602455 0.065762
H  -2.900543 -2.219834 0.09942
H  2.641544 2.341274 -0.036158
H  -2.891557 2.788306 0.003516
H  4.206013 -1.71477 0.028553
H  -5.094355 -0.958674 0.094554
H  -5.066565 1.56261 0.045936
