program: Gaussian 09
title: 000080945
version: EM64L-G09RevD.01
frameworkgroup: C1[X(C7H9NO4S)]
method: RPBEPBE
basis: SDD
operation: Freq
keyword: #p
keyword: freq=noraman
keyword: PBEPBE/SDD
title: #p freq=noraman PBEPBE/SDD
converged: YES YES NO NO
title: Mulliken charges:
elementType: S O O O O N C C C C C C C H H H H H H H H H
charge: 1.008488 -0.338082 -0.551069 -0.513006 -0.500208 -0.701226 -0.254567 0.462511 -0.456973 0.558988 -0.278424 -0.427083 -0.519152 0.287442 0.246632 0.226198 0.313420 0.321490 0.225769 0.237247 0.253126 0.398481
chargesum: 0.00000
title: Mulliken charges with hydrogens summed into heavy atoms:
elementType: S O O O O N C C C C C C C
charge: 1.008488 -0.338082 -0.152589 -0.513006 -0.500208 -0.066317 -0.254567 0.462511 -0.169531 0.558988 -0.031792 -0.200885 0.196989
polarizability: 1.57017018e+02 -1.08203027e+01 1.42620292e+02 -1.04484283e+00 4.93714402e-01 7.26523735e+01
1716.lowfreq: -6.6681 -0.0016 -0.0004 0.0015 2.0440 4.7070 49.3082 67.9735 100.4472
frequency: 49.2881 67.9720 100.4431 133.7719 142.2647 187.4427 210.1965 216.0505 231.9059 263.1820 300.6599 322.7385 342.4160 354.3260 366.6672 398.2124 421.5406 444.7897 452.3736 489.7031 544.3859 557.3259 593.9608 664.9755 707.8057 719.1832 804.9628 840.6735 867.5590 878.7263 927.1615 963.4206 979.5982 1012.2289 1037.7971 1114.2805 1142.0128 1158.5142 1175.0683 1217.7486 1258.6568 1323.1911 1381.2001 1436.5347 1439.1719 1465.6131 1474.1406 1504.6679 1570.0790 1638.6365 1651.2978 2975.4889 3071.4146 3133.7422 3136.5916 3142.8735 3165.7978 3334.4506 3569.3585 3708.4490
redmass: 4.8451 5.0652 4.5164 5.3461 4.1362 4.5373 7.5545 1.2047 6.0547 5.7530 7.3619 10.3395 1.6328 2.1668 2.6514 1.2532 5.6771 4.7243 3.2072 1.3953 4.2421 7.1427 4.0239 7.2593 3.5210 4.8265 1.4750 14.0476 6.3706 1.6175 1.3866 9.1766 6.8067 2.6798 1.5430 1.2513 1.2964 1.2976 1.2407 2.0976 1.6412 2.8522 4.6335 1.3919 2.6157 1.0589 1.0803 3.2928 7.3922 1.9007 2.0835 1.0322 1.1048 1.0899 1.1002 1.0918 1.0947 1.0653 1.0452 1.1042
irintensity: 1.8956 4.6202 1.0328 4.0707 0.3416 5.6483 1.1989 0.0610 6.5869 1.5133 4.8950 10.4185 18.1221 6.1583 4.6322 293.5600 28.8459 8.9077 11.3926 173.0811 13.3283 121.1124 10.8003 8.0423 7.4122 27.0050 48.1770 96.8044 16.9389 24.1576 0.0558 53.2861 78.7171 29.3021 2.2402 0.4627 38.4902 32.9821 88.5095 110.2920 22.4862 15.2109 22.9701 15.5693 13.7130 20.5733 52.8599 264.9641 2.1853 8.6494 221.7058 57.9050 33.1399 21.4386 4.5903 9.9095 10.1286 76.8466 94.6816 26.2227
temp: 298.150 k
press: 1.00000 atm
elementType: 16 8 8 8 8 7 6 6 6 6 6 6 6 1 1 1 1 1 1 1 1 1
symmnumber: 1
zpe: 411423.8 jmol-1
zpe.correction: 0.156703 hartree
zpe.thermalcorrener: 0.170632 hartree
zpe.thermalcorrenthalpy: 0.171576 hartree
zpe.thermalcorrgfe: 0.116517 hartree
zpe.sumelectzpe: -1024.673189 hartree
zpe.sumelectthermal: -1024.659261 hartree
zpe.sumelectthermalent: -1024.658317 hartree
zpe.sumelectthermalfe: -1024.713375 hartree
dipole: 7.9311 5.4434 -0.2105
dipole: 9.6217
quadrupole: -74.4032 -70.4301 -93.6442
quadrupole: -15.4533 1.4090 -1.5739
quadrupole: 5.0893 9.0624 -14.1517 -15.4533 1.4090 -1.5739
hfenergy: -1024.8298924 hartree
pointgroup: C01 [X(C7H9N1O4S1)]
dipole: -3.1269329 2.1326945 0.0613712 debye
dipolederiv: 1.7749631 -0.2911074 0.0011566 -0.2604636 1.5210985 0.1064046 -0.0461823 0.149267 1.4680594 -0.832969 -0.6504952 -0.0726064 -0.4937372 -1.1735779 -0.0580444 -0.1655118 -0.067091 -0.2725632 -0.7687295 0.0041783 -0.079021 -0.1277585 -0.5530893 -0.3352772 -0.1410921 -0.1725802 -0.6979763 -0.581282 0.054428 0.0243858 0.1118262 -0.6641684 0.0290056 0.0340268 0.0639003 -0.4520183 -0.6721167 0.094489 0.0840323 0.046969 -0.4984993 0.0827368 0.1227008 -0.0137125 -0.6230288 -1.1426978 -0.7094913 -0.0629583 -0.7471072 -0.6045384 -0.0217948 -0.0758059 -0.0263909 -0.7452247 -0.0911106 0.1511042 0.0125462 -0.1466264 -0.0079971 0.0120608 0.0616721 0.0039808 -0.2012268 0.3608616 0.9365 0.0759524 0.3629461 0.3139896 0.0758214 0.1226842 0.1731963 0.0719083 -0.332581 -0.4945342 -0.0321438 0.3654445 -0.1319624 0.0237122 -0.0010782 -0.033511 -0.1456694 1.0946574 0.923672 0.0982324 0.8965007 0.4350156 0.0515248 0.0959563 0.0515535 0.1583518 0.0921035 -0.3171778 -0.0157441 0.2276364 -0.0003718 0.0184523 -0.0051299 -0.0336278 -0.140629 -0.0496167 0.0656573 0.0150116 -0.54081 -0.0771819 -0.0102721 -0.0281335 0.0171433 -0.2027365 0.1831821 -0.0075727 -0.0245584 0.2507904 0.9168849 0.0227226 -0.0152222 -0.0155451 0.3077284 0.1326905 -0.0015261 0.0002189 -0.0353743 0.0290819 -0.0128933 0.0095063 -0.0025735 0.1637349 0.0814699 0.0244916 -0.0032866 0.021872 -0.0797377 -0.0193991 -0.0049783 -0.0257514 0.1604324 -0.1130124 0.056701 -0.0079794 0.0450963 0.063196 -0.0056367 -0.0071406 0.0019784 0.1648337 0.2192335 0.0537328 -0.0033155 0.0198096 0.1285741 -0.0164402 -0.0014836 -0.0149159 0.38939 0.166833 0.0437277 -0.0069554 0.0848284 0.2008655 -0.0083332 -0.0032794 -0.0067208 0.3905781 0.0391906 0.1353372 0.1127697 -0.0160554 -0.0647464 -0.0381276 0.0823789 -0.0731607 -0.0504364 0.0783105 0.10383 -0.0938743 -0.0338498 -0.0296664 0.0018584 -0.0500269 0.082478 -0.0836269 -0.0752678 -0.1057251 -0.0107944 -0.0428873 0.0432894 -0.0000771 -0.0122984 -0.0106565 0.1230118 0.4358875 -0.0702193 -0.0110681 0.0109501 0.2335415 0.1019966 0.0284379 -0.0472605 0.2171075 unknown
polarizability: 156.8684573|10.6852525|142.4426631|3.5227609|4.0879723|72.9785631 unknown
InChI: InChI=1S/C7H9NO4S/c1-12-6-3-2-5(8)4-7(6)13(9,10)11/h2-4,9H,8H2,1H3
charge 0 multiplicity 1
22 atoms
S  1.717668 -1.210488 -0.025619
O  1.076334 1.702136 0.333205
O  2.479226 -0.449686 1.468546
O  1.562207 -2.781106 0.302282
O  2.515968 -0.725174 -1.342846
N  -3.520151 -1.573659 -0.184821
C  0.001489 -0.429484 0.03674
C  -0.115546 0.972085 0.152356
C  -1.091373 -1.29371 -0.067358
C  -2.40654 -0.743489 -0.081345
C  -1.419754 1.515803 0.131662
C  -2.542344 0.672115 0.007073
C  1.015239 3.161212 0.181164
H  -0.918844 -2.374359 -0.126281
H  -1.570359 2.595964 0.218697
H  -3.543484 1.118098 -0.00934
H  -4.459415 -1.187801 -0.19589
H  -3.415403 -2.582209 -0.24302
H  0.43353 3.620552 1.00255
H  0.576972 3.431116 -0.797039
H  2.059877 3.500304 0.228721
H  2.366703 0.54098 1.308063
