program: Gaussian 09
title: 000080934
version: EM64L-G09RevD.01
frameworkgroup: C1[X(C12H8O3)]
method: RPBEPBE
basis: SDD
operation: Freq
keyword: #pfreq=noraman
keyword: PBEPBE/SDD
title: #p freq=noraman PBEPBE/SDD
converged: NO YES NO YES
title: Mulliken charges:
elementType: O O O C C C C C C C C C C C C H H H H H H H H
charge: -0.239111 -0.227465 -0.196567 0.257078 0.075542 0.148105 0.390659 0.174215 -0.373639 -0.380670 -0.343754 -0.478524 -0.808581 0.126602 -0.164167 0.249407 0.257152 0.285926 0.254063 0.241590 0.242033 0.241587 0.268518
chargesum: 0.00000
title: Mulliken charges with hydrogens summed into heavy atoms:
elementType: O O O C C C C C C C C C C C C
charge: -0.239111 -0.227465 -0.196567 0.257078 0.075542 0.148105 0.390659 0.174215 -0.124231 -0.123518 -0.057828 -0.224462 -0.083370 0.126602 0.104350
polarizability: 2.10439473e+02 5.68776247e+00 1.62388222e+02 -4.44882324e-03 7.38480666e-04 5.83389326e+01
1716.lowfreq: -7.5284 -4.4299 -0.0009 -0.0004 0.0007 7.1468 76.1270 99.0576 169.2036
frequency: 76.1260 99.0546 169.2028 189.9442 204.4218 205.3810 255.6576 292.9199 306.9948 376.5874 406.3380 445.0764 515.2659 516.6820 539.5261 563.7500 595.7722 624.5238 640.9059 688.7186 704.3326 751.7137 755.4803 774.1992 781.9174 806.4166 852.2711 877.6346 881.1037 932.0776 944.3443 973.8331 1001.2146 1014.1612 1046.2646 1110.4232 1117.2966 1141.1616 1170.8487 1213.8933 1243.5460 1255.7528 1314.1007 1375.7150 1395.5217 1402.9485 1450.5151 1466.0046 1468.9205 1473.8184 1518.0607 1576.2383 1613.7031 1619.0853 1692.8098 2983.3311 3060.3178 3104.3655 3159.2544 3172.0657 3187.9451 3239.6242 3272.5319
redmass: 4.4585 7.7251 1.6749 6.0202 2.4877 2.5848 5.4646 3.3397 4.6135 7.2490 8.8604 5.9113 6.4034 3.7536 4.3321 5.3738 4.3706 5.3154 4.4608 3.6269 7.5224 1.6977 8.7565 6.3374 2.7802 1.5560 7.6582 1.3784 1.3479 3.7529 1.3225 3.1264 2.5010 2.4199 1.5830 3.8897 1.5408 2.0283 1.6766 3.5473 1.4480 2.7964 2.3070 2.5328 1.6973 2.5615 4.6921 1.0458 1.5844 2.2890 5.1671 6.5692 8.0668 9.0643 10.6048 1.0381 1.0969 1.0985 1.0884 1.0919 1.0968 1.0920 1.1088
irintensity: 3.4636 0.2804 0.1061 2.1363 4.8623 0.0230 1.0068 0.3215 6.3538 0.6396 3.0288 21.2041 2.2895 0.0906 8.1305 10.9499 0.0033 2.1926 0.1097 3.3484 2.7510 78.9364 46.8648 18.0073 9.3457 28.9029 3.7919 26.7018 16.7352 14.6754 0.1536 2.9199 34.2173 90.9708 8.5561 15.9949 33.6241 9.9937 11.7495 10.0330 7.6477 18.1232 16.2898 99.9782 1.8573 47.3642 2.1500 17.1556 29.1462 10.8105 19.9943 0.8329 8.3519 164.2773 536.7800 11.7804 12.1773 20.9320 3.0031 2.0105 4.0778 2.8187 0.0439
temp: 298.150 k
press: 1.00000 atm
elementType: 8 8 8 6 6 6 6 6 6 6 6 6 6 6 6 1 1 1 1 1 1 1 1
symmnumber: 1
zpe: 440283.3 jmol-1
zpe.correction: 0.167695 hartree
zpe.thermalcorrener: 0.179095 hartree
zpe.thermalcorrenthalpy: 0.180039 hartree
zpe.thermalcorrgfe: 0.130513 hartree
zpe.sumelectzpe: -686.714191 hartree
zpe.sumelectthermal: -686.702791 hartree
zpe.sumelectthermalent: -686.701847 hartree
zpe.sumelectthermalfe: -686.751373 hartree
dipole: 1.3229 4.6780 0.0002
dipole: 4.8615
quadrupole: -80.7317 -86.2409 -88.4943
quadrupole: -18.8379 -0.0007 0.0000
quadrupole: 4.4239 -1.0853 -3.3386 -18.8379 -0.0007 0.0000
hfenergy: -686.8818857 hartree
pointgroup: C01 [X(C12H8O3)]
dipole: -0.5842787 -1.8212321 0.0000911 debye
dipolederiv: -1.2589821 -0.5166787 0.0000003 -0.2637831 -0.5462065 -0.0000051 -0.0001282 -0.0000498 -0.1866321 -0.8286064 0.1531527 -0.0000228 -0.01779 -0.5180569 0.000014 -0.0000115 0.0000091 -0.1308299 -0.8318599 -0.3801831 -0.0000607 -0.7771506 -1.1624276 -0.0001051 0.0001243 0.0001228 -0.3375341 -0.5861508 0.0254471 -0.0000286 0.1374991 -0.2902374 0.0000039 0.000003 0.0000087 -0.0250241 0.62622 0.2675238 -0.0000074 0.2450209 0.5007613 -0.0000085 -0.0000093 0.0000084 0.1151541 -0.1910936 -0.212908 0.0000083 -0.3815946 -0.014487 -0.0000102 -0.0000006 -0.0000131 0.0083681 0.919954 0.0870545 0.000046 -0.0029409 0.587096 0.0000216 0.0000173 -0.0000172 0.0202315 0.7041797 -0.2150365 0.0000193 -0.0700247 0.0646827 -0.0000106 0.0000025 -0.0000101 0.0474754 0.2561854 0.108392 0.0000174 0.2342991 0.0634136 0.000005 0.0000141 0.0000049 -0.1592999 -0.2961075 -0.0103276 -0.0000063 0.1615002 0.0609965 0.0000012 -0.0000024 -0.0000041 -0.1603128 -0.1808575 -0.0296466 -0.0000049 0.0019909 -0.0027626 -0.0000033 0.0000037 -0.0000054 -0.1889164 -0.1747639 0.0116727 -0.0000109 -0.4617569 -0.7868107 -0.0000264 0.0000191 -0.000027 -0.1913873 -0.0145896 0.0489611 0.0000011 0.1433557 -0.2079281 0.0000027 -0.0000267 0.0000276 0.0445166 1.4849356 0.5096196 0.0000744 0.9161131 1.5767833 0.0001168 0.0000055 -0.0000156 0.2787175 0.1146199 0.1247751 -0.0000026 0.1738988 0.4038733 -0.0000068 0.0000146 -0.0000101 -0.119367 0.0798457 0.0858979 -0.0000048 0.0485117 -0.0467524 0.0000047 -0.0000065 0.0000037 0.1483244 0.0389826 -0.0742215 -0.000003 -0.0559532 0.0111595 0.0000017 -0.0000028 0.0000005 0.1830367 0.122329 -0.0305951 -0.0000004 0.0130293 0.0274796 0.0000037 -0.0000021 0.000002 0.1974837 -0.0481317 0.0286753 -0.0000077 0.0246386 0.0738628 -0.0000053 -0.0000047 -0.000022 0.1675381 0.0830389 -0.0325699 0.0801077 -0.0097609 0.0162128 0.071559 0.0500742 0.0932571 -0.0204748 -0.1401255 0.0435095 0.0000086 -0.0751296 0.0887455 0.0000015 0.000008 -0.0000064 0.1130744 0.0830308 -0.0325831 -0.0801211 -0.0097755 0.0162172 -0.0715568 -0.050079 -0.0932705 -0.0204764 0.0379469 0.0400686 -0.000002 0.0258026 0.0843848 0.0000024 -0.0000124 0.0000066 0.2163344 unknown
polarizability: 210.7772765|4.0005805|162.0504179|0.0044204|-0.0008931|58.3389326 unknown
InChI: InChI=1S/C12H8O3/c1-7-6-11(13)15-12-8(7)2-3-10-9(12)4-5-14-10/h2-6H,1H3
charge 0 multiplicity 1
23 atoms
O  0.85956 1.52013 -0.000119
O  -3.50073 -0.24248 -0.000194
O  2.946112 2.511985 -0.000074
C  0.629685 -0.941015 -0.000071
C  0.072876 0.372584 -0.000119
C  -1.331191 0.5456 -0.000178
C  2.086702 -1.063156 -0.000032
C  -2.1456 -0.617932 -0.000175
C  -0.251739 -2.073728 -0.000085
C  -1.648727 -1.935585 -0.000131
C  -2.224773 1.688606 -0.00022
C  2.862652 0.082198 0.000012
C  2.736884 -2.428925 -0.000068
C  2.322484 1.434651 0.000111
C  -3.505768 1.180207 -0.000203
H  0.179934 -3.078705 -0.000056
H  -2.318099 -2.798692 -0.000134
H  -1.937828 2.736991 -0.000243
H  3.954425 0.022531 0.000035
H  2.437624 -3.013698 0.889928
H  3.835193 -2.344613 -0.000116
H  2.437544 -3.013675 -0.890051
H  -4.49362 1.632221 -0.000218
