program: Gaussian 09
title: 000080933
version: EM64L-G09RevD.01
frameworkgroup: C1[X(C12H13N)]
method: RPBEPBE
basis: SDD
operation: Freq
keyword: #pfreq=noraman
keyword: PBEPBE/SDD
title: #p freq=noraman PBEPBE/SDD
converged: NO YES NO NO
title: Mulliken charges:
elementType: N C C C C C C C C C C C C H H H H H H H H H H H H H
charge: -0.027119 -0.229579 0.496572 -0.231249 -0.701597 -0.701588 0.417071 -0.419581 -0.428283 -0.258997 -0.324411 -0.180933 -0.383511 0.273713 0.203769 0.213567 0.228762 0.228768 0.213564 0.203780 0.235947 0.234329 0.226014 0.242109 0.228916 0.239967
chargesum: 0.00000
title: Mulliken charges with hydrogens summed into heavy atoms:
elementType: N C C C C C C C C C C C C
charge: -0.027119 0.044134 0.496572 -0.231249 -0.055498 -0.055476 0.417071 -0.183634 -0.193954 -0.032983 -0.082302 0.047983 -0.143544
polarizability: 1.77730678e+02 -1.34367448e+01 1.56027727e+02 -7.00051091e-05 3.16560909e-05 7.28839849e+01
1716.lowfreq: -0.0003 0.0005 0.0005 5.7429 8.7587 11.5704 17.1662 95.3595 169.5013
frequency: 14.0562 95.3541 169.5009 171.7616 184.0459 218.4158 238.4335 269.6690 318.6559 386.5469 437.0920 450.7765 470.0744 495.6676 532.6634 583.5306 588.9029 664.1768 676.6662 768.3259 797.1302 808.1957 821.8748 849.6687 893.3338 912.3546 924.3324 942.0291 955.8426 980.2690 990.5741 1006.2025 1029.1840 1045.7997 1095.9327 1114.4012 1138.0578 1162.5862 1184.6105 1214.3548 1238.9854 1263.3825 1309.4035 1341.7393 1349.4816 1373.2031 1379.5237 1390.2434 1397.8842 1427.9069 1454.9148 1465.1667 1469.1710 1478.4822 1485.3789 1495.1165 1565.1798 1591.3373 1617.0886 2969.0989 2971.5731 3026.5922 3060.3861 3071.4741 3074.8516 3079.4376 3116.1645 3116.7316 3124.3301 3126.5683 3152.1820 3162.7126
redmass: 2.8116 3.6827 3.8986 3.1481 3.3589 1.0601 1.2314 2.1634 3.3732 3.0004 3.8113 3.8437 3.0739 5.2442 5.9933 3.5811 4.0406 3.0183 4.3441 1.2753 5.3510 1.7872 4.6447 2.6694 3.0632 1.3999 1.1950 1.4522 1.4255 1.3506 1.3905 3.4670 2.5601 1.8138 1.7225 2.8250 1.3430 1.6454 1.3199 2.0061 1.8858 2.0961 1.8436 1.2674 3.1978 1.1923 2.1823 1.3366 1.8499 2.6597 2.5221 1.0516 1.0438 1.0644 1.1040 3.6052 6.6605 5.7572 6.2629 1.0348 1.0354 1.0856 1.0999 1.0976 1.1003 1.0992 1.0861 1.0886 1.0918 1.0905 1.0989 1.0991
irintensity: 0.1204 2.2428 1.8178 2.2188 3.3512 0.0710 0.2211 0.0377 2.9648 1.8229 2.5892 3.3457 0.6994 0.2691 0.6175 0.3912 1.8283 0.1084 4.1084 8.8456 0.8442 74.3519 0.8324 43.1952 2.9897 0.2327 2.3741 0.4750 0.0825 0.0568 2.2785 15.9101 1.3575 25.4145 6.4690 2.1332 4.5497 1.7669 9.1542 0.7320 1.3783 3.5955 4.8103 0.5409 4.9143 14.9817 21.6896 19.2499 1.3683 0.0427 6.7929 4.1202 3.2558 13.9889 14.0810 30.8595 9.6516 5.8716 1.6787 33.4476 45.8365 4.2456 0.9984 89.2636 24.1692 35.4101 3.8198 17.0988 15.3640 20.7927 35.6342 31.5637
temp: 298.150 k
press: 1.00000 atm
elementType: 7 6 6 6 6 6 6 6 6 6 6 6 6 1 1 1 1 1 1 1 1 1 1 1 1 1
symmnumber: 1
zpe: 566711.4 jmol-1
zpe.correction: 0.215849 hartree
zpe.thermalcorrener: 0.227220 hartree
zpe.thermalcorrenthalpy: 0.228164 hartree
zpe.thermalcorrgfe: 0.177757 hartree
zpe.sumelectzpe: -518.906610 hartree
zpe.sumelectthermal: -518.895238 hartree
zpe.sumelectthermalent: -518.894294 hartree
zpe.sumelectthermalfe: -518.944702 hartree
dipole: 1.2204 1.3420 0.0001
dipole: 1.8139
quadrupole: -65.5868 -72.1525 -81.9524
quadrupole: -1.4586 0.0000 0.0002
quadrupole: 7.6438 1.0781 -8.7218 -1.4586 0.0000 0.0002
hfenergy: -519.1224586 hartree
pointgroup: C01 [X(C12H13N1)]
dipole: -0.448837 0.5548257 -0.0000471 debye
dipolederiv: -0.4530936 -0.0433505 0.0000024 -0.0167651 -0.3054889 0.0000036 0.0000065 -0.0000028 -0.2135781 -0.0640414 0.0315536 0.0000388 -0.1252333 0.0884913 -0.0000054 0.000143 -0.0000672 0.1148159 0.233271 -0.2072165 -0.0000503 -0.3100194 0.0939633 0.000022 -0.0000673 0.0000243 -0.0923863 0.1941255 0.3264171 -0.0000035 0.0337107 0.0057924 0.0000032 -0.0000115 0.0000124 0.0153741 0.0063272 0.0197643 -0.0332697 0.0888164 0.0631544 0.0045991 0.0352773 -0.0468638 -0.0277409 0.0063173 0.0197944 0.0332353 0.0888062 0.0631602 -0.0046541 -0.0353818 0.0468586 -0.0277717 -0.2461755 -0.0239382 -0.0000042 0.2342948 0.0036096 0.0000021 -0.0000072 -0.0000018 0.106618 0.0792784 0.0121619 0.0000065 0.1816712 -0.1881775 -0.0000152 -0.0000052 -0.0000022 -0.1557142 -0.0588361 -0.0820914 0.0000093 -0.06712 0.0139969 -0.0000104 0.0000116 -0.0000082 -0.1987469 0.0038679 -0.0078028 -0.0000041 -0.0486505 0.1868989 -0.0000079 -0.0000017 -0.0000084 -0.1425648 0.1905948 0.0245138 0.0000032 -0.0587594 0.1754807 -0.0000069 0.0000045 -0.0000058 -0.1441681 0.0423479 0.0914663 0.0000011 -0.0201636 -0.3192856 0.0000058 0.000003 0.0000077 -0.127959 0.1616408 -0.1172602 0.0000064 0.0639699 0.4227723 -0.000013 -0.0000004 -0.0000102 -0.071661 0.134433 -0.0773253 0.0000149 -0.0067731 -0.0304503 0.0000305 -0.0000033 0.0000314 0.0244812 0.0350094 -0.0770738 -0.0326104 -0.1396078 -0.1041054 -0.0291809 0.0086256 0.0306516 0.0641095 -0.1012157 0.1487105 -0.0418567 0.1725129 -0.0595476 0.0146916 -0.0329951 -0.0028751 0.0777031 0.0358343 -0.0306852 0.1293497 -0.0226685 0.0877646 0.0068558 0.0869639 0.0081704 -0.114922 0.0357546 -0.0307444 -0.1293993 -0.0226972 0.0877564 -0.0069353 -0.0870224 -0.0082145 -0.1148105 -0.1012257 0.1487408 0.0418736 0.1725185 -0.059533 -0.0147024 0.0330348 0.0028477 0.077678 0.0350346 -0.0770535 0.0326608 -0.1395648 -0.1041166 0.0292962 -0.0085733 -0.0305627 0.0641006 -0.123026 -0.0503865 0.0000025 -0.0494808 0.095686 -0.0000021 0.0000121 -0.0000064 0.1356905 -0.029179 0.1325964 -0.0000055 0.0611555 -0.0245707 0.0000052 -0.000005 0.000009 0.1617207 0.0661593 -0.0634586 0.0000018 -0.0461806 -0.1275092 0.0000066 -0.0000012 0.0000089 0.1544683 -0.0110208 0.0619731 -0.0000029 0.1312719 -0.0129801 0.0000043 -0.0000049 0.0000033 0.1436777 -0.1183063 -0.0715498 -0.0000007 -0.064751 0.0751568 0.0000016 -0.0000014 0.0000002 0.1648907 0.0461243 -0.0577554 0.0000011 -0.0902928 -0.1279189 0.0000062 -0.0000008 0.0000036 0.1266949 unknown
polarizability: 179.2083467|12.0951572|154.5500582|-0.0000717|-0.0000276|72.8839849 unknown
InChI: InChI=1S/C12H13N/c1-9(2)11-7-3-5-10-6-4-8-13-12(10)11/h3-9H,1-2H3
charge 0 multiplicity 1
26 atoms
N  -0.683488 -1.586198 0.000032
C  2.141149 -0.963281 0.000001
C  1.062163 0.120432 0.000017
C  -0.338777 -0.237689 0.000008
C  3.018287 -0.887174 1.278141
C  3.017732 -0.887565 -1.27855
C  -1.352568 0.805705 -0.000024
C  1.3947 1.484103 -0.00002
C  -0.955693 2.179509 -0.000048
C  0.400724 2.509138 -0.000054
C  -2.727944 0.401933 -0.000033
C  -3.051908 -0.955235 -0.000009
C  -1.988559 -1.914176 0.000029
H  1.611209 -1.932108 0.000253
H  3.571699 0.069628 1.332704
H  3.760366 -1.707382 1.28141
H  2.401444 -0.976681 2.190499
H  2.400498 -0.977448 -2.190605
H  3.759882 -1.70771 -1.281857
H  3.571018 0.069276 -1.333681
H  2.451964 1.776145 -0.000032
H  -1.725349 2.960946 -0.000078
H  0.71136 3.560027 -0.000085
H  -3.511785 1.168911 -0.000057
H  -4.092469 -1.295091 -0.000013
H  -2.217155 -2.987216 0.000052
