program: Gaussian 09
title: 000080975
version: EM64L-G09RevD.01
frameworkgroup: C1[X(C10H8O7S2)]
method: RPBEPBE
basis: SDD
operation: Freq
keyword: #p
keyword: freq=noraman
keyword: PBEPBE/SDD
title: #p freq=noraman PBEPBE/SDD
converged: YES YES NO NO
title: Mulliken charges:
elementType: S S O O O O O O O C C C C C C C C C C H H H H H H H H
charge: 0.991424 0.990681 -0.399055 -0.564144 -0.562902 -0.494952 -0.491153 -0.500335 -0.489380 0.281951 0.446652 -0.043488 -0.448158 -0.313753 -0.110077 0.161927 -0.406169 -0.375746 -0.242631 0.298391 0.249967 0.267534 0.312250 0.288555 0.376698 0.387307 0.388608
chargesum: 0.00000
title: Mulliken charges with hydrogens summed into heavy atoms:
elementType: S S O O O O O O O C C C C C C C C C C
charge: 0.991424 0.990681 -0.022357 -0.176837 -0.174295 -0.494952 -0.491153 -0.500335 -0.489380 0.281951 0.446652 -0.043488 -0.149767 -0.063786 -0.110077 0.161927 -0.138635 -0.063496 0.045924
polarizability: 3.05867531e+02 1.11092478e+01 1.84140847e+02 2.23512023e-01 1.13966568e+00 1.07115331e+02
1716.lowfreq: -7.7761 -6.0094 -0.0025 -0.0021 -0.0020 3.8811 21.0103 30.4496 35.2558
frequency: 20.8826 30.2981 35.2138 79.7733 92.3562 120.2313 125.7779 152.6164 170.7542 175.5306 183.8945 218.9822 222.7048 228.7825 250.4205 263.4634 268.5457 299.6012 309.5129 324.4065 333.1135 373.3636 386.5355 410.5884 432.3916 440.8874 489.4105 512.9290 521.6372 540.1112 543.0700 560.8559 603.4185 631.1644 667.9547 742.0640 776.7073 810.6255 827.3425 833.0290 842.9662 871.8107 888.6242 896.9855 911.7909 967.9368 971.3825 988.6227 1046.9812 1049.6430 1052.5757 1071.0066 1085.2890 1131.2754 1155.5877 1219.6506 1261.6368 1282.4802 1334.5106 1404.4537 1413.7921 1426.6495 1444.5568 1512.0762 1587.0362 1599.1140 1624.5153 3117.7021 3151.9803 3161.0730 3176.8313 3180.3388 3479.5724 3479.9919 3591.4435
redmass: 9.7543 8.6598 7.3006 9.7852 7.2601 6.2498 5.4762 4.5875 1.7689 5.1869 2.1790 3.6342 5.2913 3.0498 4.7738 1.5057 4.1059 4.3817 6.7042 10.3888 10.9057 7.8378 5.9123 10.6378 10.3372 3.1497 5.6716 8.1983 5.8141 4.7629 8.9448 5.6610 5.8672 7.7586 3.8545 6.1826 2.5168 7.3412 1.3919 9.5628 10.2630 5.8286 1.4628 1.6453 1.6510 15.0772 17.2777 1.4126 1.6508 1.1971 1.9589 2.3000 2.3845 1.2945 1.3221 1.4506 1.5575 2.2597 2.7313 3.8166 3.8254 4.0564 3.1647 5.0701 6.9781 8.5419 6.7537 1.0913 1.0895 1.0930 1.0974 1.0931 1.0662 1.0662 1.0661
irintensity: 0.1739 2.2388 2.6228 1.3685 1.1982 5.0343 5.0824 0.8244 78.1091 0.1406 8.7123 2.6309 13.4446 60.0034 29.2927 82.9745 17.6381 69.6246 34.8933 26.3173 9.8750 7.7142 0.5260 0.5496 184.4889 35.8926 6.1335 12.0420 85.7545 21.9509 114.7246 115.7572 27.0822 18.1335 34.0159 20.9249 2.8875 14.8504 24.4837 54.9420 79.8140 10.0681 24.8148 13.8487 43.3937 86.5858 71.6474 2.9313 12.6405 112.9861 27.6418 44.6616 79.9513 199.4045 8.4452 11.5879 34.4685 2.0584 56.9890 1.2892 11.3177 18.2259 45.9739 63.1996 6.6139 48.1908 12.8456 4.0853 3.5027 7.4270 4.6985 15.1892 54.0002 55.5070 41.5698
temp: 298.150 k
press: 1.00000 atm
elementType: 16 16 8 8 8 8 8 8 8 6 6 6 6 6 6 6 6 6 6 1 1 1 1 1 1 1 1
symmnumber: 1
zpe: 438986.6 jmol-1
zpe.correction: 0.167201 hartree
zpe.thermalcorrener: 0.186857 hartree
zpe.thermalcorrenthalpy: 0.187801 hartree
zpe.thermalcorrgfe: 0.117917 hartree
zpe.sumelectzpe: -1706.811829 hartree
zpe.sumelectthermal: -1706.792174 hartree
zpe.sumelectthermalent: -1706.791230 hartree
zpe.sumelectthermalfe: -1706.861113 hartree
dipole: -1.5230 -0.6915 2.6541
dipole: 3.1372
quadrupole: -146.2436 -124.0142 -130.4630
quadrupole: 0.7384 0.1968 -0.8627
quadrupole: -12.6700 9.5594 3.1106 0.7384 0.1968 -0.8627
hfenergy: -1706.9790304 hartree
pointgroup: C01 [X(C10H8O7S2)]
dipole: 0.607804 -0.2088194 -1.0537728 debye
polarizability: 306.5762851|-6.0491629|183.412271|-0.3548727|1.6678108|107.1351531 unknown
InChI: InChI=1S/C10H8O7S2/c11-10-5-8(19(15,16)17)3-6-1-2-7(4-9(6)10)18(12,13)14/h1-5,11-12,15H
charge 0 multiplicity 1
27 atoms
S  -4.318554 -0.477702 0.0729
S  4.355021 0.146185 0.07298
O  -0.42976 2.939378 0.144591
O  -4.525714 -0.328293 -1.764746
O  4.590803 -0.037419 -1.757149
O  -4.538526 -2.019086 0.507972
O  -5.152633 0.711991 0.781957
O  4.546821 1.699898 0.483293
O  5.192118 -1.021014 0.814851
C  0.239867 0.534696 0.075998
C  -0.200942 -0.849299 0.051662
C  -2.483603 -0.081854 0.063142
C  -1.599102 -1.149858 0.042269
C  1.643565 0.808349 0.068389
C  2.527406 -0.260036 0.052519
C  -0.752612 1.586975 0.107537
C  0.774603 -1.901862 0.039166
C  -2.118281 1.280635 0.097015
C  2.141187 -1.624749 0.038576
H  -1.959296 -2.183127 0.03275
H  2.058747 1.824065 0.086134
H  0.427245 -2.940127 0.027573
H  -2.864446 2.078451 0.133277
H  2.894832 -2.416938 0.041732
H  0.543096 3.110611 0.188151
H  -5.50118 -0.424609 -1.97116
H  5.571339 0.033638 -1.94958
