program: Gaussian 09
title: 000080940
version: EM64L-G09RevD.01
frameworkgroup: C1[X(C7H9NO2S)]
method: RPBEPBE
basis: SDD
operation: Freq
keyword: #p
keyword: freq=noraman
keyword: PBEPBE/SDD
title: #p freq=noraman PBEPBE/SDD
converged: YES YES NO NO
title: Mulliken charges:
elementType: S O O N C C C C C C C H H H H H H H H H
charge: 0.230221 -0.411976 -0.230913 -0.003209 -0.484347 -0.250199 -0.467313 0.253342 -0.749143 0.189618 -0.458895 0.248420 0.240228 0.264189 0.270887 0.246047 0.248142 0.219308 0.266730 0.378864
chargesum: 0.00000
title: Mulliken charges with hydrogens summed into heavy atoms:
elementType: S O O N C C C C C C C
charge: 0.230221 -0.033113 -0.230913 -0.003209 0.004301 -0.250199 0.067763 0.253342 -0.035646 0.189618 -0.192164
polarizability: 1.27666609e+02 -4.64162539e-02 1.05899127e+02 8.83533956e+00 9.43569835e-01 6.68454655e+01
1716.lowfreq: 0.0020 0.0023 0.0025 3.2272 6.9010 7.6544 17.1638 34.2150 76.6875
frequency: 17.0392 34.1592 76.6556 80.8598 100.3757 172.5108 191.4054 272.3174 300.5392 373.4134 428.5773 501.5390 510.1047 532.9347 563.5353 609.5296 639.2436 641.6932 672.1036 743.6159 763.3026 772.6108 857.9964 889.5633 970.7119 1020.1272 1043.2378 1054.4741 1079.5120 1154.0185 1173.7038 1221.8143 1240.8275 1278.5307 1291.0409 1309.5427 1368.8792 1401.4000 1439.1439 1448.0135 1459.4447 1460.4324 1473.4987 1561.6423 1665.6910 2992.6311 3002.0224 3010.7416 3051.6038 3073.4469 3076.7825 3107.1038 3222.6323 3512.7733
redmass: 9.5835 4.4186 2.7244 3.0364 1.1358 5.2845 6.7550 2.6694 3.7161 3.6256 4.5283 2.2908 3.9500 5.2496 4.8083 7.2310 1.4375 4.2330 4.5123 3.1119 1.2435 1.9825 3.7174 3.4896 1.7222 3.7469 1.5081 2.1967 2.4505 2.1836 1.3578 1.3727 1.4197 1.1459 2.3016 2.4978 1.8521 1.2729 1.0812 6.9742 1.0476 1.1310 1.1112 5.7891 8.2819 1.0371 1.0629 1.0616 1.0973 1.0983 1.0999 1.0985 1.0961 1.0640
irintensity: 1.1101 0.3183 0.4825 0.4727 0.3948 1.7158 4.2334 0.0259 3.7486 0.9216 19.4077 30.1981 21.2687 7.4043 40.5142 4.4076 123.4687 7.1326 0.2287 24.2041 37.7094 5.2094 11.8300 8.0240 7.9384 158.8108 3.8808 13.0547 127.7597 6.8710 5.5286 4.5639 1.7926 2.6896 18.7546 29.5383 53.5763 22.2892 28.5526 55.1294 6.0352 16.8342 25.2795 10.8799 216.9598 21.8089 5.2397 14.4310 0.2089 13.5575 13.2480 19.1775 0.0611 21.8749
temp: 298.150 k
press: 1.00000 atm
elementType: 16 8 8 7 6 6 6 6 6 6 6 1 1 1 1 1 1 1 1 1
symmnumber: 1
zpe: 394235.6 jmol-1
zpe.correction: 0.150156 hartree
zpe.thermalcorrener: 0.161812 hartree
zpe.thermalcorrenthalpy: 0.162756 hartree
zpe.thermalcorrgfe: 0.109698 hartree
zpe.sumelectzpe: -874.573815 hartree
zpe.sumelectthermal: -874.562159 hartree
zpe.sumelectthermalent: -874.561215 hartree
zpe.sumelectthermalfe: -874.614274 hartree
dipole: 1.2274 -0.6142 -0.7851
dipole: 1.5812
quadrupole: -71.6480 -69.8305 -75.7896
quadrupole: 0.6806 -4.8078 -2.1858
quadrupole: 0.7747 2.5922 -3.3669 0.6806 -4.8078 -2.1858
hfenergy: -874.7239714 hartree
pointgroup: C01 [X(C7H9N1O2S1)]
dipole: 0.4723477 0.1605476 0.3716307 debye
dipolederiv: -0.3496439 -0.2053706 0.0922476 -0.1803648 -0.3920875 -0.0137137 0.105561 -0.0119944 0.0830535 -0.8502557 -0.2283851 -0.5093276 -0.2107647 -0.4705543 -0.1339227 -0.4976313 -0.1389049 -0.7873661 -0.7401474 0.1109333 0.1904744 0.0062904 -0.4187542 -0.2621533 -0.0518663 -0.2301348 -0.8237944 -0.3084978 -0.0181285 0.0133218 -0.3573174 -0.7206984 0.0366214 0.0097141 -0.0482739 -0.1709536 0.0806176 0.0243587 0.0186442 0.0408647 0.0462606 -0.0401792 0.0040032 -0.0423421 0.1228209 0.1809795 -0.1411391 -0.0929953 -0.0987564 0.2546717 0.0401268 -0.1405895 0.0886459 -0.1947837 -0.355047 0.0360355 0.0625 0.1054307 0.1039842 -0.0695253 0.2794446 -0.0804269 -0.0279256 -0.0554525 -0.0246823 0.006036 0.0304786 0.3997068 0.0526502 0.012326 0.040838 -0.0061196 0.0636 -0.0876031 -0.0031023 0.0025527 -0.1183204 -0.0251637 0.0051483 0.0042712 0.0851465 1.4856664 0.0268471 0.1678475 0.0545591 0.415881 0.4953761 0.2557446 0.4721459 1.2544778 0.4028171 0.3569222 -0.126545 0.583833 0.4337119 -0.0770584 -0.0957767 -0.0225217 -0.1649376 0.0182668 -0.020711 0.0367299 -0.0514341 0.0271256 0.0985604 0.0173571 0.0656259 -0.0232711 0.0605513 0.0328873 0.0019351 0.0369812 -0.066502 -0.0639927 -0.0239026 -0.0420742 0.0707288 0.0911412 0.0259277 -0.0051955 0.0017109 -0.0421846 -0.0608422 -0.0303538 -0.0288213 0.0897615 0.0777124 -0.0162932 0.0209875 -0.0102933 0.0528435 0.0877543 -0.018418 0.0632799 -0.0073368 0.1058664 -0.0221178 0.0480311 -0.0199923 -0.0093724 0.0515718 0.0461474 0.1092482 -0.0470011 0.0306991 -0.0524431 -0.1062297 -0.0299583 0.0180056 -0.0393253 -0.0993362 -0.0837746 0.0013033 -0.1051967 0.1049105 0.0599713 0.0220883 0.0801087 -0.0005019 0.0538713 -0.0290218 0.0883974 0.0097169 0.0406883 0.0449709 -0.0048303 0.0536569 -0.0136257 0.0418094 -0.0231077 0.1785354 0.1566061 0.0573636 0.079698 0.0789221 0.3525173 -0.0626568 0.1267474 -0.0626567 0.2792644 unknown
polarizability: 128.3021636|1.0556443|103.6882151|-6.1325851|9.1670525|68.4208226 unknown
InChI: InChI=1S/C7H9NO2S/c1-5-6(11-4-8-5)2-3-7(9)10/h4,9H,2-3H2,1H3
charge 0 multiplicity 1
20 atoms
S  -1.509043 1.81241 0.029541
O  3.854477 0.478125 1.227905
O  3.452067 -0.495461 -0.842016
N  -3.115062 -0.299614 0.218215
C  0.610741 -0.023435 -0.642819
C  -0.842529 0.149256 -0.289387
C  1.555865 0.303429 0.53993
C  -1.844532 -0.806733 -0.138722
C  -1.711236 -2.29821 -0.313696
C  3.009478 0.041412 0.197132
C  -3.11691 1.01011 0.345146
H  0.883301 0.610511 -1.507261
H  0.786847 -1.063905 -0.966751
H  1.454218 1.357167 0.859352
H  1.295805 -0.304915 1.427389
H  -1.986607 -2.819981 0.620486
H  -2.401988 -2.65231 -1.09967
H  -0.687349 -2.595931 -0.590614
H  -3.982663 1.615048 0.612894
H  4.800018 0.282226 0.983747
