program: Gaussian 09
title: 000080902
version: EM64L-G09RevD.01
frameworkgroup: C1[X(C7H6N3O2)]
method: RPBEPBE
basis: SDD
operation: Freq
keyword: #p
keyword: freq=noraman
keyword: PBEPBE/SDD
title: #p freq=noraman PBEPBE/SDD
converged: NO YES NO NO
title: Mulliken charges:
elementType: O O N N N C C C C C C C H H H H H H
charge: -0.428490 -0.201636 -0.282250 0.104648 0.156610 0.262957 0.564393 -0.310123 -0.270131 -0.349033 -0.377383 0.154450 0.307295 0.309802 0.257335 0.257851 0.426688 0.417018
chargesum: 1.00000
title: Mulliken charges with hydrogens summed into heavy atoms:
elementType: O O N N N C C C C C C C
charge: -0.011472 -0.201636 0.144437 0.104648 0.156610 0.262957 0.564393 -0.002828 0.039671 -0.091697 -0.119532 0.154450
polarizability: 1.90806027e+02 1.31043618e+01 1.03943724e+02 6.03495112e-03 -5.30121408e-04 3.79678123e+01
1716.lowfreq: -10.5619 -5.0664 -0.0013 -0.0010 -0.0010 6.9784 25.7124 68.4161 102.5199
frequency: 25.4107 68.4094 102.5182 103.3924 179.0585 270.6944 307.0610 323.2262 337.5457 403.4449 461.3015 468.6305 507.7357 537.0866 610.0760 611.8587 621.5335 676.5073 724.2070 751.5942 812.0773 820.2452 853.9417 989.4909 998.8318 1003.2167 1034.6046 1103.7580 1136.4719 1145.3564 1180.7707 1203.4263 1306.8827 1332.9053 1379.2602 1405.3609 1458.8845 1478.2568 1591.6379 1597.7704 1645.1708 2114.9277 3142.6960 3146.4191 3174.1460 3189.4155 3439.9975 3532.8282
redmass: 6.2584 6.7994 4.8704 10.5577 7.3833 4.0689 9.5436 6.6819 11.3162 2.8739 2.2197 6.7245 7.0110 1.6306 5.4609 1.3423 6.4699 2.6483 5.2000 3.7951 5.5425 1.2742 1.6909 1.4004 3.8303 1.3672 3.3967 3.6790 1.4446 1.7419 2.8945 1.3922 1.2960 2.6935 3.9559 3.1408 1.5920 2.3369 6.7319 6.2816 9.8710 12.7085 1.0923 1.0913 1.0964 1.0957 1.0789 1.0648
irintensity: 1.4083 0.8928 8.7875 0.6161 1.7425 4.4795 13.1268 3.3120 2.7172 1.9404 113.0454 24.9042 7.8912 34.7681 8.6972 68.5901 6.8446 111.7323 59.9229 43.0366 0.7600 0.1684 73.1523 1.0033 45.3724 0.6158 256.5283 1.3900 9.3522 66.8203 7.1233 6.8769 3.2106 111.3340 8.1744 47.5163 15.8640 6.4102 10.9287 1.3807 185.3087 344.2568 1.2626 0.3965 6.4615 6.1218 153.5233 111.2404
temp: 298.150 k
press: 1.00000 atm
elementType: 8 8 7 7 7 6 6 6 6 6 6 6 1 1 1 1 1 1
symmnumber: 1
zpe: 330827.5 jmol-1
zpe.correction: 0.126006 hartree
zpe.thermalcorrener: 0.136727 hartree
zpe.thermalcorrenthalpy: 0.137671 hartree
zpe.thermalcorrgfe: 0.088176 hartree
zpe.sumelectzpe: -583.855141 hartree
zpe.sumelectthermal: -583.844420 hartree
zpe.sumelectthermalent: -583.843476 hartree
zpe.sumelectthermalfe: -583.892970 hartree
dipole: -9.4638 3.8159 0.0033
dipole: 10.2041
quadrupole: -12.5401 -55.5215 -68.3194
quadrupole: 0.2168 0.0027 0.0096
quadrupole: 32.9202 -10.0612 -22.8591 0.2168 0.0027 0.0096
hfenergy: -583.9811468 hartree
pointgroup: C01 [X(C7H6N3O2)]
dipole: 3.6999142 -1.5581046 0.0015931 debye
dipolederiv: -0.9554647 -0.4897132 -0.0001447 -0.5689138 -0.7831539 0.0000346 0.0016011 0.002051 -0.4174293 -0.810924 0.2162627 -0.0004095 -0.0210286 -0.7781235 0.0013994 0.0000462 -0.001642 -0.3004849 -0.0972961 -0.1796989 0.0000145 -0.5107882 -0.2665061 -0.0002635 -0.0004209 -0.000014 -0.1334879 1.1107592 0.371065 0.0000787 1.4771179 0.4447222 0.0005179 0.0015337 0.0001662 0.1916063 -0.762199 -0.0154492 -0.000282 -1.0152439 0.0343832 -0.0003845 -0.0010318 -0.0000661 0.1359678 -0.1985836 -0.0178052 0.0003809 0.0948531 0.0045163 -0.000104 -0.0002968 0.0001588 0.0342437 0.2441639 -0.041381 0.0003034 -0.0224715 0.1697341 0.0002236 -0.0002659 0.0000492 0.0800416 -0.2400181 -0.1441443 -0.000024 -0.0995964 0.0632846 -0.0000736 -0.0009596 -0.0000278 -0.0472004 -0.0529938 0.1803766 0.0002574 0.1450386 -0.0517494 0.0000408 -0.0009042 0.0002756 -0.0505559 0.047088 0.1393963 0.0001955 -0.1309007 -0.1185524 0.000066 0.0002877 0.0002237 -0.1384322 0.0485695 -0.1715212 -0.0000258 0.1571323 0.0577734 0.0001132 0.0003175 -0.0001064 -0.1344901 1.8165724 0.1158629 -0.0002851 0.3635879 1.2801766 -0.001185 -0.0000855 -0.0005352 0.259823 0.1347766 0.0255784 -0.0000342 -0.0111842 0.083377 -0.0000254 -0.000103 -0.0000385 0.1616234 0.1212649 -0.0299439 -0.0000963 -0.0215491 0.1063714 -0.0000368 -0.0001801 -0.0000436 0.1654676 -0.0029286 -0.0674569 -0.0001559 -0.0464858 0.0706561 -0.0001241 -0.0000437 -0.0001628 0.1824194 0.0386996 0.0895518 -0.0000337 0.0770127 0.0252938 -0.0000429 0.0000995 0.0000265 0.1810415 0.2289078 -0.0947692 -0.0000741 -0.0301049 0.382078 -0.0000595 -0.0000635 -0.0001248 0.4042686 0.3296061 0.1137891 0.0003348 0.1635247 0.2757186 -0.000096 0.0004693 -0.0001901 0.4255777 unknown
polarizability: 191.1867396|11.7689709|103.5629867|0.0398947|0.0328998|37.9678362 unknown
InChI: InChI=1S/C7H6N3O2/c8-10-9-6-3-1-5(2-4-6)7(11)12/h1-4,9,11H
charge 1 multiplicity 1
18 atoms
O  -3.730149 -0.793774 0.000492
O  -3.409527 1.517236 0.000941
N  2.672544 -0.807464 0.001322
N  3.619118 0.07912 0.001421
N  4.436727 0.917438 0.001681
C  -1.485514 0.028377 -0.001795
C  1.252759 -0.472175 0.000258
C  -0.568792 1.111174 -0.000364
C  -1.017334 -1.308771 -0.002066
C  0.817033 0.871075 0.000649
C  0.365516 -1.573113 -0.001123
C  -2.950367 0.355709 -0.003232
H  -0.961345 2.132869 -0.000204
H  -1.738125 -2.130215 -0.003201
H  1.513398 1.71696 0.001741
H  0.728695 -2.607425 -0.001477
H  2.980733 -1.792727 0.001744
H  -4.698771 -0.565596 0.003511
