program: Gaussian 09
title: 000080935
version: EM64L-G09RevD.01
frameworkgroup: C1[X(C8H8ClNO4S)]
method: RPBEPBE
basis: SDD
operation: Freq
keyword: #p
keyword: freq=noraman
keyword: PBEPBE/SDD
title: #p freq=noraman PBEPBE/SDD
converged: YES YES NO NO
title: Mulliken charges:
elementType: Cl S O O O O N C C C C C C C C H H H H H H H H
charge: -0.029896 0.889019 -0.537877 -0.537963 -0.190774 -0.190812 0.028751 -0.493852 -0.067122 -0.220007 -0.220497 -0.535762 -0.328766 -0.328779 0.394505 0.284184 0.284266 0.299716 0.299712 0.300270 0.300252 0.300684 0.300748
chargesum: 0.00000
title: Mulliken charges with hydrogens summed into heavy atoms:
elementType: Cl S O O O O N C C C C C C C C
charge: -0.029896 0.889019 -0.537877 -0.537963 -0.190774 -0.190812 0.028751 0.074598 -0.067122 0.079709 0.079215 0.064759 -0.028082 -0.028031 0.394505
polarizability: 2.16476643e+02 -5.76889984e+00 9.82967983e+01 -1.43871263e-01 -6.91502486e-01 1.33399647e+02
1716.lowfreq: -14.1953 -7.8556 -4.5363 -3.1205 -0.0027 -0.0026 -0.0022 30.5957 33.7340
frequency: -10.3096 30.5866 33.6390 65.7861 77.1491 92.9459 111.1760 160.3443 193.3818 211.3613 213.9751 239.7588 276.6436 348.3756 357.0458 398.6424 410.8151 477.3280 491.5229 504.1664 571.0415 611.4625 661.0716 675.1949 688.6276 731.5290 780.0525 785.6531 796.8286 857.4987 872.9522 898.9875 978.8764 991.3444 993.2709 1000.8961 1042.8669 1062.4589 1084.4323 1094.4060 1104.6882 1169.1061 1213.9242 1216.8847 1264.2314 1279.4217 1289.2636 1372.0480 1388.2065 1409.7052 1423.2518 1449.3192 1467.8450 1579.0041 1606.6065 3060.0827 3076.9368 3149.1789 3156.6768 3157.4099 3170.3352 3186.8721 3188.7762
redmass: 3.4539 15.1438 5.4643 5.3855 3.8362 9.5836 9.4396 8.3686 12.8107 7.2282 7.6581 4.6057 7.8000 6.5626 10.0543 10.1052 2.8787 4.5677 8.3910 7.3609 6.7712 7.0884 5.0627 7.4677 7.3949 4.3019 10.5510 1.1703 13.8939 1.2380 1.5440 2.9372 1.9394 1.8913 2.5339 1.3763 2.2836 4.4663 4.2259 1.0885 1.2569 1.2201 1.2106 7.1808 1.2001 1.2460 1.1805 5.3929 6.5196 1.1088 7.4292 2.1552 1.0940 6.1667 8.4338 1.0564 1.0555 1.1117 1.0907 1.0913 1.1126 1.0948 1.0960
irintensity: 0.9264 0.7613 0.2945 0.2621 7.2720 8.5489 3.9371 11.1210 8.5132 7.2614 0.6788 0.1827 1.9607 0.4469 21.6985 56.0648 0.0040 12.2665 90.0033 0.6318 19.3408 0.0234 19.3147 41.0039 11.3042 9.2481 55.9046 1.9487 55.1564 1.4246 45.7891 53.0491 26.0013 1.5167 9.1120 0.0974 32.9532 27.1275 4.5182 10.0226 4.7096 8.4049 32.6231 218.0599 1.3101 0.1672 6.4260 34.5712 77.5855 9.1806 49.9746 8.6834 9.9695 18.9044 0.3747 4.7035 5.2815 0.0152 1.0301 9.0576 0.5805 3.8071 1.3395
temp: 298.150 k
press: 1.00000 atm
elementType: 17 16 8 8 8 8 7 6 6 6 6 6 6 6 6 1 1 1 1 1 1 1 1
symmnumber: 1
zpe: 402267.5 jmol-1
zpe.correction: 0.153216 hartree
zpe.thermalcorrener: 0.167736 hartree
zpe.thermalcorrenthalpy: 0.168680 hartree
zpe.thermalcorrgfe: 0.109127 hartree
zpe.sumelectzpe: -1522.052336 hartree
zpe.sumelectthermal: -1522.037816 hartree
zpe.sumelectthermalent: -1522.036872 hartree
zpe.sumelectthermalfe: -1522.096425 hartree
dipole: -0.9949 -2.2107 -0.0428
dipole: 2.4247
quadrupole: -131.9856 -114.1700 -100.8283
quadrupole: 7.7186 0.1377 -0.1611
quadrupole: -16.3243 1.4913 14.8330 7.7186 0.1377 -0.1611
hfenergy: -1522.205552 hartree
pointgroup: C01 [X(C8H8Cl1N1O4S1)]
dipole: 0.3258598 0.8931613 0.0778979 debye
dipolederiv: -0.5740069 -0.2662716 -0.0260548 -0.3309 -0.400957 -0.0267939 -0.0337337 -0.0276818 -0.1309532 1.8093088 -0.0507767 -0.0038522 0.0847561 1.3364627 0.0226108 0.0079069 0.0217943 1.0952439 -0.7234464 0.0072957 -0.0307034 -0.0603738 -0.6026424 0.0207337 -0.0239003 0.169561 -0.5680132 -0.7234993 0.0023215 0.0311649 -0.0635448 -0.5676369 -0.0211622 0.0126207 -0.1691948 -0.6033464 -0.7148466 0.064299 0.1889088 0.0948684 -0.2293672 -0.0036147 0.1425023 0.0159739 -0.6429904 -0.7142304 0.0964434 -0.1749995 0.1185297 -0.2400777 0.0758871 -0.1236796 0.0558141 -0.6330971 1.7071446 -0.2580754 -0.021953 -0.3183744 0.248125 -0.0740306 -0.0275001 -0.0734742 1.074341 -0.1090803 0.0894076 0.0091969 0.2452054 -0.0719172 -0.0009361 0.0241369 -0.0003182 -0.0656998 -0.0049428 0.0097056 0.0011156 -0.0599912 -0.2476171 -0.0207464 -0.0055679 -0.020522 -0.0233154 -0.3699495 -0.0135385 0.2045617 0.0476267 -0.0715862 -0.0776453 -0.1062247 0.0032307 -0.0408426 -0.3697319 0.0234775 -0.2049969 0.0275944 -0.0837345 0.0699344 0.1123936 -0.0109871 -0.0285105 0.5691127 0.3865024 0.0369676 0.0723553 0.3513504 0.0223051 0.0088416 0.0224332 0.1400024 0.0507293 -0.0055395 -0.1739395 -0.0540685 -0.067931 0.0303658 0.2128552 -0.0341831 -0.040818 0.0507662 -0.0366318 0.1704127 -0.015469 -0.0676442 -0.0350737 -0.2189721 0.0291861 -0.0415609 -0.4907729 0.0842434 0.0066615 0.1157345 0.0547155 -0.0029173 0.0094431 -0.0030546 0.0864201 0.0179919 -0.0335308 -0.0426985 0.0277515 0.0107779 0.034116 -0.0787927 0.0202386 0.0246579 0.0183777 -0.0408032 0.0358012 0.0128472 0.0212866 -0.0343306 0.0825779 -0.0204084 0.0146903 0.1273785 0.0211137 -0.0535837 0.0071871 0.1410151 0.023304 -0.0333658 0.0011904 0.0864584 0.1271312 0.0111286 0.056663 0.0012893 0.1436483 -0.0129706 0.0341746 0.0091846 0.0841567 0.0704358 -0.059642 -0.0051102 -0.0048208 0.0126239 -0.0545273 0.0564924 -0.0460307 0.0123305 0.0718784 -0.0595446 -0.006083 0.0065578 -0.0065505 0.0502775 -0.056374 0.0418091 0.031249 0.0869541 0.0099102 0.0491228 0.0216348 0.1698107 -0.0008533 0.0124243 0.0052839 0.0838231 0.0872975 0.0185057 -0.0466018 0.0236043 0.1678458 0.0160676 -0.0082586 0.0101551 0.0857742 unknown
polarizability: 216.6796377|2.9941286|98.3361039|0.5224128|-3.0010359|133.1573471 unknown
InChI: InChI=1S/C8H8ClNO4S/c9-5-6-15(13,14)8-3-1-7(2-4-8)10(11)12/h1-4H,5-6H2
charge 0 multiplicity 1
23 atoms
Cl 5.368694 2.203014 0.224071
S  2.053753 -0.88547 -0.07602
O  2.383595 -1.721884 1.291482
O  2.389497 -1.459889 -1.571405
O  -4.5319 0.437313 1.17985
O  -4.529414 0.638329 -1.092545
N  -3.944343 0.413615 0.033329
C  2.983767 0.835321 0.0839
C  0.201199 -0.441319 -0.038693
C  -0.446021 -0.436211 1.207759
C  -0.443138 -0.212421 -1.265555
C  4.473885 0.546899 0.058074
C  -1.827537 -0.149609 1.231596
C  -1.824718 0.073772 -1.240709
C  -2.484057 0.107264 0.007785
H  2.631861 1.419962 -0.779589
H  2.631741 1.250071 1.040647
H  0.106443 -0.678468 2.121595
H  0.111643 -0.286796 -2.206682
H  4.804811 0.112818 -0.895756
H  4.800703 -0.065578 0.910093
H  -2.3957 -0.12777 2.164958
H  -2.390863 0.262436 -2.156284
