program: Gaussian 09
title: 000080850
version: EM64L-G09RevD.01
frameworkgroup: C1[X(C13H11ClN2O4S)]
method: RPBEPBE
basis: SDD
operation: Freq
keyword: #p
keyword: freq=noraman
keyword: PBEPBE/SDD
title: #p freq=noraman PBEPBE/SDD
converged: YES YES NO NO
title: Mulliken charges:
elementType: Cl S O O O O N N C C C C C C C C C C C C C H H H H H H H H H H H
charge: 0.057251 0.952079 -0.502739 -0.522343 -0.179291 -0.166363 -0.284774 0.007615 -0.096167 0.325640 -0.304832 -0.677859 -0.248302 0.543749 -0.322438 -0.317561 -0.173973 -0.326447 -0.226908 -0.217771 -0.231999 0.331846 0.207351 0.265538 0.284825 0.301962 0.236740 0.293635 0.276837 0.233948 0.241328 0.239421
chargesum: 0.00000
title: Mulliken charges with hydrogens summed into heavy atoms:
elementType: Cl S O O O O N N C C C C C C C C C C C C C
charge: 0.057251 0.952079 -0.502739 -0.522343 -0.179291 -0.166363 -0.284774 0.007615 -0.096167 0.325640 0.027014 0.079855 0.053660 0.543749 -0.085698 -0.023926 0.102864 -0.326447 0.007040 0.023558 0.007422
polarizability: 2.27005685e+02 -4.95790503e+00 2.52121435e+02 1.83165420e+01 7.17127329e+00 1.70539137e+02
1716.lowfreq: -8.1992 -1.9724 0.0018 0.0026 0.0027 2.6805 11.0337 17.4311 32.3397
frequency: 10.9483 17.3998 32.2676 45.3442 60.3262 90.9529 95.8319 103.6202 145.2290 153.8622 183.1142 191.9420 204.0503 207.8598 223.4195 257.0271 270.8185 288.2973 329.0883 341.4170 370.8067 387.3721 407.0361 416.8627 419.9246 450.7749 479.5260 506.1965 533.8718 543.0088 588.9254 609.0560 640.7026 675.7920 690.2375 703.6133 731.3891 756.8225 775.0281 799.1202 815.0837 836.9733 839.8116 916.1675 919.1408 945.7405 976.3692 979.3328 982.5033 997.7547 1007.1074 1016.9106 1028.0887 1062.5688 1074.9912 1083.0840 1110.0223 1139.6773 1140.3072 1175.8350 1186.3502 1207.8864 1243.7454 1245.9555 1319.0441 1357.1177 1379.6384 1380.4115 1395.6345 1413.1925 1436.6927 1438.7172 1450.2821 1468.9421 1490.9919 1567.4036 1572.4196 1581.0270 1594.7966 2931.9421 3045.5903 3098.1804 3133.9539 3144.8670 3156.8961 3157.3745 3168.4251 3169.0209 3178.8664 3183.3115
redmass: 6.1941 7.5301 5.6259 13.7563 5.3353 5.1372 8.7969 6.7865 5.2412 7.3040 11.7972 5.3209 11.8682 2.6792 3.5783 2.3358 5.9400 4.2244 4.3372 8.3089 8.2888 8.6733 2.8755 5.8521 5.5368 4.8245 7.6918 5.2705 3.4200 5.0624 6.9098 6.4159 7.5992 6.5574 1.7630 9.5910 4.7672 5.2458 1.8522 12.1983 12.0953 1.2617 1.3225 1.5108 1.4486 13.0745 1.4639 1.3535 4.7901 1.3377 6.0102 8.3548 2.1720 2.3201 1.4016 1.5444 3.1177 1.4305 1.3817 1.0551 1.1897 12.6943 1.3320 3.6922 1.3642 3.7363 10.2780 7.1226 7.2038 1.1318 2.4721 2.3163 1.0611 1.9972 1.0883 7.3269 5.6676 8.2653 5.7933 1.0445 1.0881 1.0989 1.0854 1.0889 1.0900 1.0933 1.0928 1.0980 1.0965 1.0977
irintensity: 1.1461 0.8182 0.1116 0.2563 2.5830 1.5329 1.1295 0.9501 0.2828 13.1442 0.5865 6.8019 3.5897 0.8391 4.5086 0.2765 1.3918 1.2156 2.2765 1.3299 11.1238 16.5715 2.0361 34.0863 46.9135 10.4797 27.1091 33.3969 15.1983 4.4450 18.7266 0.2630 11.1108 2.7867 48.7514 19.7111 3.3224 2.3317 55.2640 40.6289 100.8822 0.5832 19.9648 8.0237 5.8403 48.6742 0.7507 0.1107 1.7608 0.5278 3.5794 76.4095 3.8928 15.8304 23.6309 8.4524 7.3733 1.9407 10.5471 0.0811 4.6898 170.0473 6.7767 2.2603 1.1701 13.2012 25.1168 6.5866 59.4371 17.7903 80.0339 4.7792 31.4667 23.5708 13.3712 20.3103 1.9459 11.5961 1.0192 39.9140 13.3826 0.8421 2.0875 5.4531 4.7685 17.6824 11.6989 14.9250 1.8740 5.3067
temp: 298.150 k
press: 1.00000 atm
elementType: 17 16 8 8 8 8 7 7 6 6 6 6 6 6 6 6 6 6 6 6 6 1 1 1 1 1 1 1 1 1 1 1
symmnumber: 1
zpe: 573519.8 jmol-1
zpe.correction: 0.218442 hartree
zpe.thermalcorrener: 0.238827 hartree
zpe.thermalcorrenthalpy: 0.239771 hartree
zpe.thermalcorrgfe: 0.166046 hartree
zpe.sumelectzpe: -1768.710223 hartree
zpe.sumelectthermal: -1768.689838 hartree
zpe.sumelectthermalent: -1768.688894 hartree
zpe.sumelectthermalfe: -1768.762619 hartree
dipole: -0.1420 -0.1446 -5.5649
dipole: 5.5686
quadrupole: -147.9088 -136.8839 -136.9186
quadrupole: 19.7055 -4.4893 6.9051
quadrupole: -7.3384 3.6865 3.6518 19.7055 -4.4893 6.9051
hfenergy: -1768.9286652 hartree
pointgroup: C01 [X(C13H11Cl1N2O4S1)]
dipole: 0.017681 -0.0638142 2.189843 debye
polarizability: 225.4047636|1.8935938|252.9866944|20.1525509|-4.435646|171.274799 unknown
InChI: InChI=1S/C13H11ClN2O4S/c1-15(10-5-3-2-4-6-10)21(19,20)11-7-8-12(14)13(9-11)16(17)18/h2-9H,1H3
charge 0 multiplicity 1
32 atoms
Cl 4.606896 -0.154985 0.937475
S  -1.354533 -1.979164 -0.85675
O  -1.662513 -1.329964 -2.312906
O  -1.414501 -3.584226 -0.576274
O  2.098594 2.008605 -1.972808
O  3.284994 2.313065 -0.045787
N  -2.649507 -1.113612 0.469537
N  2.544496 1.612556 -0.828944
C  0.387928 -1.415381 -0.358059
C  -2.427349 0.295146 0.521294
C  0.845039 -0.170063 -0.801739
C  -2.556697 -1.907974 1.715005
C  1.155926 -2.271268 0.451191
C  2.12408 0.256254 -0.37786
C  -1.922299 0.971729 1.671428
C  -2.780139 1.052351 -0.637009
C  2.4461 -1.849199 0.831247
C  2.930671 -0.582512 0.433273
C  -1.78649 2.375526 1.661101
C  -2.609164 2.449621 -0.644351
C  -2.11493 3.11904 0.503133
H  0.2536 0.463164 -1.470363
H  -1.642896 -1.740548 2.325247
H  -3.441012 -1.654342 2.327495
H  -2.618635 -2.975266 1.4462
H  0.766559 -3.252583 0.741555
H  -1.658283 0.413264 2.575231
H  -3.186526 0.52741 -1.505879
H  3.087098 -2.50015 1.432055
H  -1.415943 2.889932 2.554602
H  -2.876469 3.021024 -1.539467
H  -1.996094 4.20765 0.49713
