program: Gaussian 09
title: 000081286
version: EM64L-G09RevD.01
frameworkgroup: C1[X(C22H17N3O9S2)]
method: RPBEPBE
basis: SDD
operation: Freq
keyword: #p
keyword: freq=noraman
keyword: PBEPBE/SDD
title: #p freq=noraman PBEPBE/SDD
converged: YES YES NO NO
title: Mulliken charges:
elementType: S S O O O O O O O O O N N N C C C C C C C C C C C C C C C C C C C C C C H H H H H H H H H H H H H H H H H
charge: 0.978889 0.997284 -0.298897 -0.294351 -0.554635 -0.539179 -0.477945 -0.509324 -0.552404 -0.467565 -0.248613 -0.485252 -0.658959 -0.450910 0.144209 0.195187 0.388743 0.290035 0.292893 -0.088330 0.397576 -0.193552 -0.382282 -0.270692 -0.416445 -0.393317 -0.245537 -0.228375 0.462142 -0.417953 -0.374746 -0.430081 -0.346423 0.490854 0.225934 -0.779536 0.329615 0.305095 0.397625 0.315755 0.255402 0.362826 0.394428 0.257997 0.270716 0.226700 0.316486 0.389412 0.374983 0.306281 0.262284 0.262118 0.213833
chargesum: 0.00000
title: Mulliken charges with hydrogens summed into heavy atoms:
elementType: S S O O O O O O O O O N N N C C C C C C C C C C C C C C C C C C C C C C
charge: 0.978889 0.997284 -0.298897 -0.294351 -0.165222 -0.164196 -0.477945 -0.509324 -0.552404 -0.467565 -0.248613 -0.087627 0.098296 -0.144629 0.144209 0.195187 0.388743 0.290035 0.292893 -0.088330 0.397576 -0.193552 -0.382282 -0.270692 -0.086830 -0.088222 0.070218 0.027027 0.462142 -0.159955 -0.104030 -0.203381 -0.029937 0.490854 0.225934 -0.041301
polarizability: 7.96182232e+02 -3.58137812e+01 4.68713939e+02 7.82673024e+00 -2.73337177e+01 1.93398864e+02
1716.lowfreq: 0.0010 0.0013 0.0017 2.2630 2.9793 5.0152 19.3157 20.2182 22.8132
frequency: 19.1737 20.2099 22.8101 35.0803 37.8271 50.9755 53.3628 59.1464 67.8142 76.5263 88.7431 96.6861 104.9156 125.1947 126.4675 142.1624 162.1959 172.5367 174.1307 181.8684 188.3049 201.8013 205.9227 224.4720 236.8034 243.2236 250.9032 259.5655 273.3917 291.8085 300.0855 304.8667 325.2415 327.3339 335.8842 344.7020 357.2250 381.4957 389.2590 401.4032 404.1215 407.7794 415.7021 422.9136 427.9279 446.7233 454.4184 484.5151 501.0486 507.8445 518.5971 523.9623 528.9347 551.3719 561.2006 580.1595 595.6348 620.2907 624.2784 638.8882 647.1477 657.5596 681.3356 686.8091 711.5142 721.6088 726.9801 750.2142 775.7563 787.8893 805.3650 818.7820 822.8389 824.3384 829.3844 836.0081 854.6882 865.8651 878.0562 888.9306 892.9773 924.2565 931.6865 936.3921 944.1008 950.9751 954.2499 972.0858 984.6540 992.1849 992.4950 1003.6817 1017.1947 1039.9589 1042.2487 1048.6143 1059.8007 1100.1812 1112.4373 1132.4450 1144.7454 1175.9141 1191.5320 1205.8176 1217.7353 1241.1973 1265.9879 1270.2234 1289.6328 1311.4086 1322.4846 1356.4566 1363.2001 1379.6415 1385.1678 1391.0427 1399.5949 1426.1582 1426.4835 1435.2750 1443.4332 1448.9968 1463.0526 1470.2060 1488.2707 1509.0775 1511.8851 1524.3555 1547.2421 1576.5774 1586.9316 1600.4324 1605.4210 1618.2103 1626.9330 1637.2305 2967.1866 2996.7826 3098.2314 3100.0227 3120.9269 3149.1545 3151.4917 3153.4995 3159.1824 3162.0595 3178.1487 3195.1255 3226.7796 3422.8971 3464.8692 3476.2756 3531.4911
redmass: 7.3795 9.0821 5.8350 8.1245 5.7317 4.9169 1.8495 3.4341 4.0440 4.4464 8.0201 6.6240 7.5364 5.7509 10.5229 6.0942 6.8715 8.9463 4.5087 2.6152 6.1347 7.8862 4.9258 4.6669 5.3774 5.8551 3.7146 6.3387 2.7561 5.0674 2.7186 4.9937 7.6338 7.0746 4.6220 4.6457 5.5243 6.9034 6.8524 6.3954 8.1166 4.9356 4.0160 11.2633 8.4301 7.3204 10.1572 7.3173 4.9116 5.1994 5.9848 3.1521 4.9076 12.8268 9.0497 5.9741 3.1730 5.0509 6.1137 6.0883 1.1855 6.6449 4.0862 7.8684 6.1536 3.9894 1.5467 2.8550 6.7018 3.7621 3.2663 8.0365 1.5911 6.4942 2.1837 3.8311 1.5578 1.2073 6.8084 5.9356 5.0805 1.3070 6.3527 1.6520 6.8488 1.7055 4.0277 1.3784 5.9571 1.7807 1.3497 2.2488 1.3770 1.6329 2.9117 1.2314 2.1795 2.8739 1.2585 1.3476 2.4806 1.2336 1.1562 2.0705 3.0903 2.4600 2.0584 2.2967 1.8601 1.6645 3.2160 4.2498 4.7944 3.8221 9.7989 1.2234 8.6106 3.9091 3.7363 3.8475 3.1888 1.0450 5.3200 1.1000 2.3412 3.1241 6.9225 5.6574 4.8724 4.1769 1.5448 5.4534 2.4067 5.4551 4.9466 5.4677 1.0842 1.0364 1.1000 1.0986 1.0890 1.0885 1.0920 1.0953 1.0911 1.0921 1.0984 1.0950 1.0578 1.0653 1.0971 1.0669 1.0767
irintensity: 0.7305 0.5530 1.6392 0.3564 5.3252 2.1094 1.1499 1.6090 0.4396 4.8794 0.2505 1.1096 1.0067 0.8680 1.3860 2.5863 7.3558 0.7287 15.1482 26.1105 0.4403 1.4662 14.7887 0.9263 16.0191 4.9715 10.6388 25.2666 36.4488 37.0365 7.4693 42.6601 11.1201 11.0117 21.9079 0.8531 1.2093 31.2994 20.2471 11.9952 1.0446 21.3037 17.4894 56.6889 82.9893 22.6399 21.8422 2.8699 4.2106 9.0226 57.5269 16.4271 7.8670 199.7856 53.2971 15.3140 1.0547 4.6647 9.9096 16.7914 57.0246 8.0748 1.3125 15.6838 8.1353 1.0143 78.5574 9.7284 18.5695 5.4870 22.9299 116.8052 39.6231 9.0803 44.2736 4.6202 59.4948 179.9470 17.5193 17.8509 13.3256 66.3845 5.4603 9.6777 116.5224 33.2164 44.7839 0.1896 7.8362 28.8068 5.4999 16.3171 2.6522 14.6950 42.7729 56.1141 18.7509 8.6045 36.4954 13.7957 44.4350 10.7066 47.5365 11.0671 164.4396 9.1838 39.8187 103.2265 28.2839 42.2148 658.8466 448.1195 16.6959 46.1287 49.6954 72.3632 43.0847 8.7712 137.3485 4.9050 3.8645 15.1108 39.2806 22.2350 358.5260 661.7358 180.6790 126.9299 35.5782 17.3712 92.2103 23.7057 115.6876 216.4565 165.3115 66.6434 48.1979 16.3777 15.5155 8.3497 29.3759 14.9466 6.6934 7.0138 8.5441 7.8872 6.7781 10.1103 56.2208 38.4789 249.0287 41.5116 23.1164
temp: 298.150 k
press: 1.00000 atm
elementType: 16 16 8 8 8 8 8 8 8 8 8 7 7 7 6 6 6 6 6 6 6 6 6 6 6 6 6 6 6 6 6 6 6 6 6 6 1 1 1 1 1 1 1 1 1 1 1 1 1 1 1 1 1
symmnumber: 1
zpe: 950394.8 jmol-1
zpe.correction: 0.361986 hartree
zpe.thermalcorrener: 0.395933 hartree
zpe.thermalcorrenthalpy: 0.396877 hartree
zpe.thermalcorrgfe: 0.294450 hartree
zpe.sumelectzpe: -2483.087478 hartree
zpe.sumelectthermal: -2483.053531 hartree
zpe.sumelectthermalent: -2483.052587 hartree
zpe.sumelectthermalfe: -2483.155014 hartree
dipole: 1.8414 -0.5304 4.5200
dipole: 4.9094
quadrupole: -191.9263 -226.9620 -225.6192
quadrupole: -43.9435 16.6566 -6.2465
quadrupole: 22.9095 -12.1262 -10.7833 -43.9435 16.6566 -6.2465
hfenergy: -2483.4494641 hartree
pointgroup: C01 [X(C22H17N3O9S2)]
dipole: 0.744571 0.113946 -1.7785926 debye
polarizability: 800.0557514|3.2674991|464.1450963|-9.4030465|-29.9452821|194.0941869 unknown
InChI: InChI=1S/C22H17N3O9S2/c1-10(26)24-11-5-7-12(8-6-11)25-14-9-16(36(32,33)34)20(23)19-18(14)22(28)17-13(21(19)27)3-2-4-15(17)35(29,30)31/h2-9,24-25,29,32H,23H2,1H3
charge 0 multiplicity 1
53 atoms
S  1.094593 -4.537213 -0.171054
S  -3.404254 3.793147 -0.034101
O  -1.353168 1.883516 -0.374908
O  -4.170111 -2.778016 0.494572
O  0.775168 -4.793824 -1.977251
O  -2.753618 3.840501 -1.775935
O  2.662187 -4.228725 0.055457
O  0.381757 -5.752393 0.64278
O  -4.684541 4.801688 -0.108624
O  -2.280596 4.117084 1.067824
O  7.354021 0.36778 1.293557
N  0.873491 0.651805 -0.331978
N  -1.997599 -4.17794 0.406813
N  6.4081 1.934966 -0.17724
C  -1.271721 -0.507661 -0.043568
C  -2.008768 -1.732244 0.149832
C  -3.432439 0.820096 0.095644
C  -4.164711 -0.391233 0.284292
C  0.169544 -0.525415 -0.169045
C  -1.972542 0.774286 -0.115931
C  -1.331772 -3.010515 0.185083
C  -3.466946 -1.704705 0.31381
C  0.093773 -2.9577 -0.026458
C  -4.173285 2.027462 0.092108
C  0.825374 -1.798692 -0.197261
C  -5.57412 -0.362594 0.442695
C  -5.564436 2.074918 0.244502
C  -6.269783 0.856117 0.417493
C  2.269694 0.884131 -0.272032
C  2.777445 1.982188 -1.021977
C  3.167965 0.144842 0.545819
C  4.139655 2.308864 -0.972015
C  4.537732 0.462661 0.592351
C  5.04099 1.54892 -0.174681
C  7.478766 1.362962 0.52267
C  8.826543 2.039324 0.285948
H  1.899322 -1.864655 -0.395982
H  -6.089508 -1.317004 0.581747
H  0.22661 1.474367 -0.464009
H  -6.079393 3.041103 0.230112
H  -7.357368 0.877576 0.53548
H  -1.479251 -5.058534 0.510343
H  -3.025247 -4.090994 0.516587
H  2.094949 2.569918 -1.64518
H  2.799485 -0.653237 1.197223
H  4.509454 3.158527 -1.559646
H  5.221497 -0.104053 1.226313
H  1.240454 -5.636221 -2.256651
H  -3.218184 4.648532 -2.154297
H  6.634564 2.739777 -0.765842
H  9.541948 1.288004 -0.089958
H  9.217364 2.405927 1.250843
H  8.789613 2.882579 -0.42547
