program: Gaussian 09
title: 000080812
version: EM64L-G09RevD.01
frameworkgroup: C1[X(C10H11N3)]
method: RPBEPBE
basis: SDD
operation: Freq
keyword: #pfreq=noraman
keyword: PBEPBE/SDD
title: #p freq=noraman PBEPBE/SDD
converged: NO YES NO YES
title: Mulliken charges:
elementType: N N N C C C C C C C C C C H H H H H H H H H H H
charge: -0.267714 -0.036980 -0.349972 -0.633929 0.101798 0.228113 0.382361 -0.760144 -0.345489 -0.389242 -0.228645 -0.205220 -0.254190 0.264666 0.264663 0.255616 0.231877 0.231801 0.326708 0.276002 0.221283 0.221482 0.224019 0.241137
chargesum: 0.00000
title: Mulliken charges with hydrogens summed into heavy atoms:
elementType: N N N C C C C C C C C C C
charge: -0.267714 -0.036980 -0.108836 -0.104601 0.101798 0.228113 0.382361 -0.040850 -0.018781 -0.113240 -0.007362 0.016262 -0.030171
polarizability: 1.98542478e+02 2.97385986e+00 1.40183165e+02 -1.96510140e-03 -1.14885020e-02 5.94263500e+01
1716.lowfreq: -9.3252 -8.1687 -0.0003 0.0004 0.0007 6.2753 54.8322 84.6695 129.6674
frequency: 54.7767 84.6487 129.6591 147.0773 151.2930 226.8433 279.1694 330.7641 337.7545 364.4372 413.3448 438.3874 507.2791 536.3095 570.3169 572.3399 615.1093 663.1523 702.9154 767.5759 768.7440 781.9970 858.6273 891.3656 901.6918 930.8228 932.7947 979.0531 985.2513 988.0628 1005.8516 1028.8921 1033.8278 1052.5547 1055.3324 1100.6177 1135.6349 1169.9613 1185.6992 1194.4984 1221.6716 1322.8539 1325.4395 1372.6813 1383.8498 1402.1519 1417.9008 1447.1838 1456.9196 1458.1360 1487.9762 1581.1478 1598.0201 1611.5346 1619.6528 2972.4107 3001.7495 3043.7763 3054.3033 3106.9697 3124.2037 3134.9359 3157.8096 3175.7240 3189.7186 3366.9909
redmass: 3.8742 3.6207 3.0068 1.0925 3.9415 3.8667 3.5075 3.9332 4.9189 5.1027 3.0146 2.3798 3.2960 3.3927 5.5539 4.4100 6.4100 6.5741 2.0996 1.5589 5.5807 1.2189 1.2486 3.5034 1.7967 4.6097 1.4100 2.3198 5.4342 1.3307 1.2912 2.0877 1.4849 2.3242 2.2578 1.9004 1.2147 1.0509 1.1515 1.5051 2.6430 1.6961 2.2509 2.8855 8.1924 1.5601 1.1018 2.4038 1.1131 1.0466 2.5785 5.9974 6.4847 5.9004 7.3999 1.0383 1.0607 1.0971 1.1010 1.0976 1.0850 1.0908 1.0973 1.0962 1.0945 1.0767
irintensity: 0.0218 10.3658 2.6602 0.0034 2.0292 3.0047 2.4701 0.2410 5.8788 6.4864 0.0267 0.1883 11.1989 10.9861 21.7213 0.3050 0.4136 19.6289 29.7493 106.3054 9.1951 43.8836 0.4210 11.5845 1.4016 10.2117 12.8556 21.2702 5.4940 0.1707 4.6768 12.5204 7.3973 100.5791 36.5283 92.5592 0.4487 0.0176 8.4254 23.6736 60.3748 21.7112 9.4515 43.5361 6.1758 25.2406 22.3136 7.8918 14.3478 18.4016 175.5727 1.5641 5.7436 150.1891 159.9153 36.5607 8.8372 15.3960 6.0010 9.7379 0.1939 29.0926 29.9262 21.2394 4.0084 5.2376
temp: 298.150 k
press: 1.00000 atm
elementType: 7 7 7 6 6 6 6 6 6 6 6 6 6 1 1 1 1 1 1 1 1 1 1 1
symmnumber: 1
zpe: 501894.1 jmol-1
zpe.correction: 0.191161 hartree
zpe.thermalcorrener: 0.202364 hartree
zpe.thermalcorrenthalpy: 0.203308 hartree
zpe.thermalcorrgfe: 0.153923 hartree
zpe.sumelectzpe: -550.955293 hartree
zpe.sumelectthermal: -550.944090 hartree
zpe.sumelectthermalent: -550.943146 hartree
zpe.sumelectthermalfe: -550.992531 hartree
dipole: 4.5192 -0.0078 -0.0004
dipole: 4.5192
quadrupole: -56.7882 -73.5696 -80.2197
quadrupole: 3.8823 -0.0010 -0.0011
quadrupole: 13.4043 -3.3771 -10.0273 3.8823 -0.0010 -0.0011
hfenergy: -551.146454 hartree
pointgroup: C01 [X(C10H11N3)]
dipole: -1.7771673 0.053638 -0.0001397 debye
dipolederiv: -1.2250754 -0.4785138 -0.0001201 0.3754117 -1.04342 -0.0001956 0.0000782 -0.0002569 -0.0980918 0.1267806 -0.3239724 -0.0000275 -0.8306738 0.1581805 0.0000563 -0.000098 0.0000131 -0.1446044 -0.1673147 0.3894618 0.0001106 -0.0993882 -1.2500977 -0.0001505 0.0000081 -0.000095 -0.4677757 -0.3310756 0.1898639 -0.0000909 0.0795839 -0.246021 -0.0001231 -0.0000301 -0.0001425 0.2387214 0.3679221 0.2136902 0.0001338 0.4354557 1.5016284 0.0003092 0.0001235 0.0002615 0.085945 0.0823254 0.0373693 -0.0000414 -0.0343179 0.4499499 0.0001848 -0.0005883 0.0003612 -0.0529626 1.4589066 0.2292352 0.0000401 0.156169 0.0243259 -0.0000303 0.0000308 0.0000039 0.0765059 -0.106596 0.0766698 0.0000808 0.0232191 -0.0610055 -0.0000129 0.0007331 -0.0002174 0.072885 -0.4183852 -0.0354314 -0.0000131 0.1445932 -0.0614377 0.0000037 0.0000209 0.0000157 -0.1647176 -0.2397857 -0.0740195 -0.0000259 -0.252267 -0.063122 0.0000035 -0.0000458 0.0000221 -0.1808587 0.1566647 -0.0461141 -0.0000063 -0.072013 0.109813 0.0000012 0.0000014 0.0000229 -0.1592342 0.0605996 0.030298 0.0000128 0.0896325 0.1517352 0.0000175 0.0000119 0.0000134 -0.159028 -0.055848 -0.0063085 -0.0000086 -0.0260357 -0.1252911 0.0000076 0.0000014 0.0000003 -0.1843458 0.0549033 0.0068096 0.0542272 -0.036127 0.082947 0.0269464 0.1041676 0.049327 0.0088525 0.0549382 0.0069016 -0.054192 -0.0360027 0.0829667 -0.0268957 -0.104139 -0.0492806 0.0087173 0.0795249 -0.1003497 0.00017 0.0023172 -0.0822866 0.0002587 -0.0000419 0.0003093 0.1215921 -0.0330804 0.0344844 0.0945203 0.032361 0.0754142 0.0556202 0.1527761 0.0018919 -0.0381813 -0.033343 0.0341339 -0.0946999 0.0317218 0.0752897 -0.0559528 -0.1529762 -0.0021658 -0.0375437 0.2210255 -0.0115399 0.0000146 0.016604 0.060622 0.0000035 0.000021 -0.000008 0.1762339 0.1076265 0.0767565 0.0000012 0.0883023 0.0230294 -0.0000043 -0.0000018 -0.0000092 0.1697231 -0.0173704 0.0931187 0.0000018 0.1264152 -0.0530955 -0.0000059 0.0000044 -0.0000124 0.1530408 0.0353079 -0.0748698 -0.000006 -0.1021553 -0.1091418 -0.0000161 -0.0000072 -0.0000167 0.1540455 -0.1569238 -0.0309858 -0.0000037 -0.0324483 0.0867502 -0.0000039 -0.0000054 -0.0000044 0.1672604 -0.0217271 -0.2366881 -0.0000777 -0.080358 0.2122667 -0.0000216 -0.0000448 -0.0000332 0.253821 unknown
polarizability: 198.6643501|1.3102027|140.0612932|0.002291|0.011428|59.42635 unknown
InChI: InChI=1S/C10H11N3/c1-8-7-10(11)13(12-8)9-5-3-2-4-6-9/h2-6,11H,7H2,1H3
charge 0 multiplicity 1
24 atoms
N  -0.581023 -0.136341 0.000008
N  -1.377144 1.052378 0.00018
N  -0.888078 -2.529973 -0.000477
C  -2.828217 -0.807487 -0.000431
C  -1.372952 -1.311505 -0.000342
C  -2.64793 0.699407 -0.000033
C  0.839988 0.015944 0.000025
C  -3.752269 1.712037 0.000226
C  1.696683 -1.117651 0.000009
C  1.393672 1.32582 0.000093
C  3.09516 -0.926253 0.000026
C  2.79286 1.492038 0.000125
C  3.655738 0.370661 0.000075
H  -3.376981 -1.165081 0.890798
H  -3.376523 -1.164454 -0.892205
H  -3.335029 2.731837 -0.001319
H  -4.400367 1.597683 0.890542
H  -4.402612 1.595716 -0.888164
H  1.254973 -2.1161 -0.000043
H  0.723585 2.187675 0.000145
H  3.748908 -1.806247 -0.000011
H  3.209165 2.506043 0.000188
H  4.742636 0.506851 0.000084
H  -1.638842 -3.245799 -0.000701
