program: Gaussian 09
title: 000080800
version: EM64L-G09RevD.01
frameworkgroup: C1[X(C12H18O)]
method: RPBEPBE
basis: SDD
operation: Freq
keyword: #pfreq=noraman
keyword: PBEPBE/SDD
title: #p freq=noraman PBEPBE/SDD
converged: YES YES NO NO
title: Mulliken charges:
elementType: O C C C C C C C C C C C C H H H H H H H H H H H H H H H H H H
charge: -0.289182 -0.342133 -0.389564 -0.351154 -0.254841 -0.693356 -0.344063 0.380893 -0.412691 -0.377720 -0.217495 -0.228409 -0.242793 0.184138 0.184779 0.209088 0.208908 0.196962 0.196988 0.185428 0.184187 0.201068 0.200551 0.209415 0.209402 0.217529 0.278010 0.224271 0.223190 0.223133 0.225459
chargesum: 0.00000
title: Mulliken charges with hydrogens summed into heavy atoms:
elementType: O C C C C C C C C C C C C
charge: -0.289182 0.026784 0.028432 0.042797 0.114774 -0.057010 0.057557 0.380893 -0.134681 -0.153449 0.005695 -0.005276 -0.017334
polarizability: 1.81345366e+02 -2.91990105e+00 1.29848358e+02 1.15011403e+00 6.56885452e-01 8.07925308e+01
1716.lowfreq: -38.0245 -5.7406 -3.6861 -0.0007 0.0003 0.0007 1.6484 24.1412 45.3566
frequency: -28.2530 23.7301 45.3189 54.0155 82.6343 107.6142 129.1619 135.7497 204.2713 221.3547 235.4778 253.5410 375.3539 402.2676 408.6917 463.6018 503.3469 592.8730 616.5694 702.3639 728.2506 737.8151 767.8983 805.9711 849.6034 856.9176 884.5768 908.9068 941.4574 964.6557 979.0593 989.6152 994.8998 1015.4590 1020.3348 1026.6432 1053.8021 1073.3239 1077.1091 1088.0164 1126.6340 1149.5843 1170.6487 1183.9031 1198.3802 1206.1612 1214.4818 1248.0592 1256.3781 1277.7517 1288.5186 1301.9175 1317.8642 1342.4233 1353.6129 1383.1517 1389.5677 1402.7706 1438.9487 1462.4676 1465.2854 1468.7830 1477.7829 1478.4778 1485.3551 1486.5103 1491.9117 1595.0112 1618.9674 2894.5956 2907.6342 2934.4099 2951.9374 2953.3522 2968.9352 2972.2404 2989.7826 2993.5666 3023.3876 3055.3376 3069.1360 3072.0780 3107.9629 3124.0610 3138.4036 3157.2607 3177.2544
redmass: 1.8563 3.6011 4.0713 2.5483 2.3981 2.5027 3.7201 2.3011 2.9880 4.7128 1.0974 3.6843 3.3546 2.8420 4.1723 2.7732 3.5975 5.3211 6.4020 2.3281 1.0711 1.3503 1.1080 4.1861 1.1684 1.2511 2.1223 1.3098 4.9475 1.1508 1.3704 6.2850 1.3442 3.5108 1.6927 2.2425 4.3270 2.3138 2.1879 2.2182 2.6324 1.4365 1.0530 1.1131 1.3255 1.1726 2.4767 1.2884 1.2411 1.0779 1.1047 1.3790 1.3606 1.3790 1.6503 3.6237 1.2354 1.8092 2.1232 1.0909 1.0669 1.0789 1.0728 1.0452 1.4764 1.4458 1.0975 6.1793 6.0372 1.0546 1.0542 1.1036 1.1057 1.0585 1.0584 1.0369 1.0590 1.0989 1.1031 1.1043 1.1009 1.0992 1.0876 1.0866 1.0931 1.0989 1.0955
irintensity: 0.7688 0.0616 0.0515 1.3125 5.5899 1.4415 0.6673 3.9896 1.7438 0.4186 0.0096 1.7176 0.6560 0.0222 0.2115 9.3575 5.4085 1.7712 0.0660 26.7231 9.9422 88.4520 0.0145 1.0456 0.9326 0.1860 5.7677 1.6911 17.4183 1.5579 0.0262 0.1184 0.0769 4.2897 2.1673 26.1886 88.9704 37.3328 13.0553 75.5251 0.9918 1.1974 0.3026 2.4968 0.0211 4.0028 2.2266 1.1084 0.0672 0.1113 0.5937 21.9413 1.5378 30.7379 1.6456 7.6957 15.0186 1.6707 10.8508 13.1487 1.0684 5.0795 1.1702 11.8327 9.0997 14.7647 13.4718 1.7754 9.6177 23.2784 96.6397 56.8170 44.9021 17.6094 55.1043 34.9859 42.4166 2.1602 14.5706 47.6463 108.6372 51.9004 11.7584 1.3327 36.1588 33.5029 6.0578
temp: 298.150 k
press: 1.00000 atm
elementType: 8 6 6 6 6 6 6 6 6 6 6 6 6 1 1 1 1 1 1 1 1 1 1 1 1 1 1 1 1 1 1
symmnumber: 1
zpe: 706364.4 jmol-1
zpe.correction: 0.269040 hartree
zpe.thermalcorrener: 0.282505 hartree
zpe.thermalcorrenthalpy: 0.283449 hartree
zpe.thermalcorrgfe: 0.226879 hartree
zpe.sumelectzpe: -542.274769 hartree
zpe.sumelectthermal: -542.261304 hartree
zpe.sumelectthermalent: -542.260360 hartree
zpe.sumelectthermalfe: -542.316930 hartree
dipole: 1.0766 -1.4799 0.0439
dipole: 1.8306
quadrupole: -74.2689 -73.6517 -83.2171
quadrupole: 0.7365 0.2050 0.1487
quadrupole: 2.7770 3.3942 -6.1712 0.7365 0.2050 0.1487
hfenergy: -542.5438092 hartree
pointgroup: C01 [X(C12H18O1)]
dipole: -0.4390479 0.2950392 0.4887767 debye
polarizability: 181.3324858|2.364093|96.8278112|-3.4025387|22.8796255|113.8259581 unknown
InChI: InChI=1S/C12H18O/c1-2-3-7-10-13-11-12-8-5-4-6-9-12/h4-6,8-9H,2-3,7,10-11H2,1H3
charge 0 multiplicity 1
31 atoms
O  -0.329406 0.093313 0.175863
C  -4.149688 0.024104 0.247527
C  -2.699081 -0.232313 -0.221074
C  -5.203492 -0.59316 -0.700276
C  -1.661319 0.389389 0.717247
C  -6.653002 -0.335975 -0.235518
C  0.741817 0.658992 0.991982
C  2.090213 0.318106 0.378612
C  2.19039 -0.492404 -0.776671
C  3.273966 0.818756 0.978137
C  3.458676 -0.798449 -1.323233
C  4.539822 0.512728 0.432617
C  4.636539 -0.298947 -0.722567
H  -4.329186 1.11701 0.326445
H  -4.292345 -0.390041 1.267858
H  -2.550589 0.182543 -1.236907
H  -2.509672 -1.321161 -0.288636
H  -5.060704 -0.180594 -1.719703
H  -5.026132 -1.684951 -0.779292
H  -1.755314 -0.032912 1.744256
H  -1.805082 1.492326 0.786133
H  0.680865 0.254786 2.029542
H  0.622187 1.76512 1.062201
H  -6.83013 -0.766109 0.768484
H  -6.864554 0.748553 -0.177151
H  -7.386337 -0.786015 -0.929612
H  1.271814 -0.870611 -1.233164
H  3.207779 1.450656 1.87382
H  3.525602 -1.426896 -2.218923
H  5.447097 0.906239 0.905148
H  5.618067 -0.537083 -1.147942
