program: Gaussian 09
title: 000080785
version: EM64L-G09RevD.01
frameworkgroup: C1[X(C8H8ClNO3)]
method: RPBEPBE
basis: SDD
operation: Freq
keyword: #p
keyword: freq=noraman
keyword: PBEPBE/SDD
title: #p freq=noraman PBEPBE/SDD
converged: YES YES NO NO
title: Mulliken charges:
elementType: Cl O O O N C C C C C C C C H H H H H H H H
charge: -0.066643 -0.269335 -0.204319 -0.204084 0.023724 0.571411 0.271605 0.226885 -0.511493 -0.331802 -0.301746 -0.769464 -0.513729 0.294236 0.252325 0.265036 0.275976 0.272254 0.213905 0.261474 0.243785
chargesum: 0.00000
title: Mulliken charges with hydrogens summed into heavy atoms:
elementType: Cl O O O N C C C C C C C C
charge: -0.066643 -0.269335 -0.204319 -0.204084 0.023724 0.571411 0.271605 0.226885 -0.217257 -0.079477 -0.036711 -0.221234 0.205435
polarizability: 1.74903092e+02 -2.49892361e+00 1.24236698e+02 -3.14082492e+00 2.28916012e+00 6.52175220e+01
1716.lowfreq: -32.9452 -0.0021 -0.0020 -0.0017 3.5304 6.9824 11.0965 32.1547 61.8255
frequency: -32.9187 32.0838 61.8047 116.3400 122.3700 128.0745 190.0849 215.1885 252.5714 280.6159 350.3944 372.2028 397.1041 430.3256 491.2918 536.9739 550.1037 628.2432 658.5221 705.5681 720.4753 742.0477 753.4919 854.6682 890.2674 920.2239 937.4429 951.9976 977.3289 1064.8598 1100.7224 1119.0199 1142.8902 1150.3369 1192.7722 1224.0166 1228.7678 1249.3872 1263.2312 1356.0685 1370.5503 1416.2431 1425.6043 1451.3777 1462.5005 1480.7292 1487.5730 1559.9058 1617.6792 2982.9785 3068.3048 3096.1649 3140.8138 3142.8354 3149.4574 3165.6929 3173.3717
redmass: 7.3402 7.7671 6.0897 4.5480 2.9651 1.2423 5.3637 5.0229 4.3960 4.8747 6.8296 4.9044 5.6369 4.4936 6.5937 5.4856 4.2117 5.3578 7.4178 5.9952 5.2620 4.4942 9.5282 1.5185 2.5333 1.9201 1.6892 7.1010 1.3744 2.9095 1.2239 1.2076 1.2338 1.3365 4.2817 2.8707 3.5205 1.1570 1.8005 6.2003 4.2207 4.5905 1.2536 1.0674 1.1209 1.0563 2.9298 7.4370 6.7589 1.0336 1.0578 1.0997 1.1040 1.0900 1.1110 1.0918 1.0961
irintensity: 0.6951 1.8921 0.0959 5.2182 2.6508 2.0401 3.4196 3.2255 2.4996 0.7730 3.9270 0.8615 4.1797 1.4736 40.1839 4.5087 8.7047 87.2905 8.5426 6.2792 3.7963 4.8977 10.9976 26.4129 7.2528 10.8679 5.0943 59.6128 2.5760 33.6370 15.3908 5.6321 19.7926 17.3161 173.7899 122.1614 120.3829 14.5967 20.0387 92.4434 2.8727 21.5466 12.2256 7.2169 7.3688 20.9112 116.2858 24.7919 49.1254 76.4806 17.6133 21.1814 14.1760 4.1644 4.0084 2.5346 5.0510
temp: 298.150 k
press: 1.00000 atm
elementType: 17 8 8 8 7 6 6 6 6 6 6 6 6 1 1 1 1 1 1 1 1
symmnumber: 1
zpe: 392086.0 jmol-1
zpe.correction: 0.149338 hartree
zpe.thermalcorrener: 0.161118 hartree
zpe.thermalcorrenthalpy: 0.162062 hartree
zpe.thermalcorrgfe: 0.109919 hartree
zpe.sumelectzpe: -1049.067096 hartree
zpe.sumelectthermal: -1049.055315 hartree
zpe.sumelectthermalent: -1049.054371 hartree
zpe.sumelectthermalfe: -1049.106514 hartree
dipole: -0.4307 -4.2820 3.5329
dipole: 5.5680
quadrupole: -87.2056 -84.0226 -81.8953
quadrupole: -7.4756 -1.7332 -0.3100
quadrupole: -2.8311 0.3519 2.4792 -7.4756 -1.7332 -0.3100
hfenergy: -1049.2164332 hartree
pointgroup: C01 [X(C8H8Cl1N1O3)]
dipole: 0.3720659 1.7087137 1.3193736 debye
dipolederiv: -0.6708833 0.0931963 0.1247046 0.1357181 -0.1806749 -0.0289818 0.4603029 -0.0939981 -0.3726168 -1.4891365 0.5030181 0.1404214 0.2705155 -0.4307189 -0.0586447 -0.1104325 0.0878805 -0.3530102 -0.4897448 0.0537316 0.0084414 0.0206957 -0.9296179 0.0024773 -0.0053165 0.0094805 -0.2234326 -0.8854194 -0.0134813 0.0213649 -0.0519833 -0.4207913 -0.0139616 0.0146808 -0.071883 -0.2096274 1.3407029 0.2989921 -0.0430507 0.3009832 1.4815332 0.0101203 0.0083604 0.0400769 0.176113 -0.1103079 -0.0910637 0.020076 -0.0516096 -0.2979539 0.0172487 -0.146445 0.0382181 -0.13164 -0.4101487 -0.3451119 0.0311308 -0.1337154 -0.4974854 0.0120783 -0.0699696 0.0566468 0.0585319 1.1403476 -0.4589191 0.0646886 -0.0444655 0.4723225 0.0090469 0.329458 -0.1738111 0.0278097 0.1314335 0.2977563 0.0051841 0.0099686 0.0005141 -0.0304218 0.0279142 0.0148103 -0.0867382 0.1702649 -0.0216404 0.0300127 -0.0281362 0.2092686 -0.0290063 0.0102346 -0.0717715 -0.0880415 -0.5534863 0.0798355 0.0130301 -0.1922344 0.0750627 -0.0669367 0.0511654 -0.114635 -0.1095317 0.8729953 -0.1327898 -0.2159569 -0.1955066 0.1856838 0.0563234 -0.3750678 0.0958336 0.5050396 0.7653539 -0.2264622 -0.1694098 -0.036255 0.2269739 0.0831532 -0.353091 0.1819445 0.3882483 0.1230943 0.0152669 -0.0156679 0.0600718 0.0630307 0.0247248 0.0063478 0.0253351 0.1487492 0.0013673 -0.0946286 -0.0079745 -0.0810254 0.040586 0.0113476 -0.0069441 0.021471 0.1372492 0.075135 0.0465061 -0.022459 0.0298346 -0.0210468 0.0344756 -0.0187351 0.0371984 0.1493025 0.0299179 -0.0214858 0.0716868 0.0603853 -0.0207763 0.0745034 0.0538713 0.042936 -0.015635 -0.0351881 -0.0048885 0.0100768 -0.0648807 0.0064324 -0.0997764 0.0425909 -0.0610622 -0.0175869 -0.0067862 -0.058427 -0.0546821 0.0095658 -0.044558 -0.1299582 0.0953772 -0.1573692 -0.0562179 0.0762786 -0.0092545 0.0286382 -0.1156025 0.0069534 0.1004898 0.059798 0.0536159 0.0307279 -0.07579 0.08985 -0.0402555 0.0976761 0.0752622 0.0216984 -0.0740997 0.0390825 0.042307 unknown
polarizability: 174.2601607|-5.6371585|124.5214276|-5.4613271|-3.6263434|65.5757233 unknown
InChI: InChI=1S/C8H8ClNO3/c1-13-8-3-2-6(5-9)4-7(8)10(11)12/h2-4H,5H2,1H3
charge 0 multiplicity 1
21 atoms
Cl 4.297666 -0.439137 -0.946286
O  -2.103399 1.413267 -0.533504
O  -0.998472 -2.737799 0.099851
O  -2.727782 -1.262213 0.055273
N  -1.465665 -1.531446 0.092329
C  1.878556 0.193448 0.371985
C  -0.491158 -0.415506 0.115781
C  -0.843175 0.943119 -0.170586
C  0.853128 -0.771677 0.379957
C  1.540015 1.538674 0.058821
C  0.21008 1.895748 -0.211583
C  3.295851 -0.195377 0.669656
C  -3.128642 1.588973 0.52402
H  1.069829 -1.826568 0.573972
H  2.326563 2.300807 0.023969
H  -0.061897 2.924577 -0.465948
H  3.378179 -1.160177 1.18867
H  3.85447 0.584945 1.205803
H  -2.764163 2.312898 1.277386
H  -3.382054 0.622584 0.987006
H  -4.00293 1.997059 -0.002972
