program: Gaussian 09
title: 000080790
version: EM64L-G09RevD.01
frameworkgroup: C1[X(C11H16O)]
method: RPBEPBE
basis: SDD
operation: Freq
keyword: #pfreq=noraman
keyword: PBEPBE/SDD
title: #p freq=noraman PBEPBE/SDD
converged: YES YES NO NO
title: Mulliken charges:
elementType: O C C C C C C C C C C C H H H H H H H H H H H H H H H H
charge: -0.298650 -0.237735 0.603216 -0.535133 -0.692502 -0.694420 -0.495379 0.154512 0.306892 -0.361209 -0.815680 -0.519138 0.207733 0.249712 0.212900 0.209945 0.228091 0.225720 0.211364 0.212285 0.230944 0.228043 0.254680 0.222836 0.224916 0.216563 0.217314 0.232179
chargesum: 0.00000
title: Mulliken charges with hydrogens summed into heavy atoms:
elementType: O C C C C C C C C C C C
charge: -0.298650 -0.030002 0.603216 -0.285421 -0.041566 -0.045051 -0.264435 0.154512 0.306892 -0.133165 -0.113248 0.146918
polarizability: 1.57958089e+02 1.27942852e+00 1.25310166e+02 6.17428304e-01 -4.48660577e+00 8.16989632e+01
1716.lowfreq: -24.0194 -12.7484 -0.0008 -0.0006 0.0004 7.7852 15.8427 37.5551 94.6157
frequency: -16.3020 37.2308 94.6049 110.4913 129.5090 141.1293 174.8182 200.7590 214.9027 242.7772 271.2833 292.1652 325.1533 376.3319 402.7753 462.7634 476.5681 512.2905 551.7218 661.1320 682.4520 731.2603 741.6067 831.5108 853.1324 898.4275 903.4435 917.0604 951.9909 955.5767 971.5496 994.0820 1045.4891 1058.9561 1110.5062 1113.3551 1115.9595 1132.0437 1152.0693 1174.0393 1207.3054 1239.2155 1265.8175 1310.0916 1322.2933 1373.6722 1376.5194 1392.0555 1395.0490 1404.7358 1439.9136 1456.3743 1466.0694 1466.4698 1467.5079 1467.7743 1478.2762 1482.6711 1483.6075 1498.3743 1576.7662 1619.7266 2950.7316 2972.8452 2973.7082 2977.2705 2980.9350 3034.6047 3055.0057 3066.8975 3074.1734 3076.6026 3081.9864 3094.3476 3109.0000 3111.1481 3133.5542 3138.1646
redmass: 2.5689 2.7933 2.5673 1.1116 2.9543 1.2359 2.1910 1.6521 1.4983 1.1003 2.9669 3.0948 3.6236 3.4322 3.1980 3.4278 3.1676 3.5195 3.7512 4.3310 4.2502 2.8770 3.7238 1.3399 3.7443 1.8341 2.3178 1.1853 1.3657 1.4383 2.5600 2.0305 1.5225 1.5811 1.2871 2.5470 2.2592 1.7633 1.4142 1.6831 1.7644 2.3156 1.6440 1.3358 2.1487 4.6152 1.1994 1.2716 1.2308 1.9129 1.3059 1.0594 1.0642 1.0459 1.0506 1.0636 1.0490 1.1164 1.1642 2.2321 5.9782 7.0376 1.0318 1.0404 1.0349 1.0363 1.0831 1.1037 1.0923 1.1000 1.0992 1.1004 1.0996 1.0999 1.1001 1.0869 1.0934 1.0942
irintensity: 5.2029 0.1646 1.6117 0.2840 1.5402 0.0575 1.1359 1.5466 0.8986 0.0911 3.5420 1.7010 2.7998 1.6556 2.3353 4.9489 6.8647 2.1179 1.2689 6.0027 1.2882 5.5690 5.6655 24.7806 7.8460 5.4084 15.3426 3.2248 0.6366 0.3237 41.1589 35.8181 9.0597 17.7420 5.2087 1.3799 48.6519 7.6891 9.6818 10.5200 1.2454 26.1402 16.8085 1.2596 27.3021 2.9695 15.7905 14.1276 6.9227 21.6382 5.7011 9.4169 10.4767 6.8562 1.5043 6.7932 20.7203 9.8763 3.7423 60.7112 19.8563 13.6568 67.7870 43.1199 33.7923 33.2964 17.9202 52.9701 23.0435 2.2399 101.9367 26.6185 40.7346 11.2666 32.7412 14.2898 31.3512 5.1706
temp: 298.150 k
press: 1.00000 atm
elementType: 8 6 6 6 6 6 6 6 6 6 6 6 1 1 1 1 1 1 1 1 1 1 1 1 1 1 1 1
symmnumber: 1
zpe: 628243.9 jmol-1
zpe.correction: 0.239285 hartree
zpe.thermalcorrener: 0.252053 hartree
zpe.thermalcorrenthalpy: 0.252997 hartree
zpe.thermalcorrgfe: 0.200365 hartree
zpe.sumelectzpe: -503.059323 hartree
zpe.sumelectthermal: -503.046555 hartree
zpe.sumelectthermalent: -503.045611 hartree
zpe.sumelectthermalfe: -503.098243 hartree
dipole: 0.0040 0.0243 -1.7038
dipole: 1.7039
quadrupole: -65.8801 -68.2012 -77.5396
quadrupole: -0.6911 -3.6453 1.9217
quadrupole: 4.6602 2.3391 -6.9993 -0.6911 -3.6453 1.9217
hfenergy: -503.2986084 hartree
pointgroup: C01 [X(C11H16O1)]
dipole: 0.0054835 0.0091406 0.6702925 debye
polarizability: 157.9611114|-1.2523861|125.3061311|-0.1807281|4.5268212|81.6999757 unknown
InChI: InChI=1S/C11H16O/c1-8(2)10-6-5-9(3)11(7-10)12-4/h5-8H,1-4H3
charge 0 multiplicity 1
28 atoms
O  -1.984681 -1.482804 -0.59658
C  2.713368 0.092839 0.077805
C  1.206064 0.362454 0.054918
C  0.278308 -0.671899 -0.225212
C  3.226807 -0.413361 -1.296519
C  3.097757 -0.899796 1.207838
C  0.692862 1.658562 0.309359
C  -1.107788 -0.414093 -0.24666
C  -1.633585 0.884753 -0.000545
C  -0.697194 1.911318 0.275023
C  -3.124857 1.157986 -0.056751
C  -2.56603 -2.188368 0.557246
H  3.219175 1.056245 0.291552
H  0.614995 -1.691071 -0.447736
H  2.761985 -1.381305 -1.560956
H  4.32288 -0.559842 -1.273059
H  2.98849 0.305421 -2.100902
H  2.767157 -0.528871 2.194796
H  4.193349 -1.04817 1.240697
H  2.627643 -1.887255 1.042718
H  1.388154 2.479348 0.524563
H  -1.066509 2.928284 0.457494
H  -3.617119 0.485221 -0.779479
H  -3.607871 0.997731 0.927543
H  -3.323946 2.202949 -0.351648
H  -3.182958 -1.510057 1.179605
H  -1.771681 -2.635529 1.187396
H  -3.200277 -2.983789 0.135796
