program: Gaussian 09
title: 000080782
version: EM64L-G09RevD.01
frameworkgroup: C1[X(C8H10ClNO)]
method: RPBEPBE
basis: SDD
operation: Freq
keyword: #p
keyword: freq=noraman
keyword: PBEPBE/SDD
title: #p freq=noraman PBEPBE/SDD
converged: NO NO NO NO
title: Mulliken charges:
elementType: Cl O N C C C C C C C C H H H H H H H H H H
charge: -0.082842 -0.301037 -0.692475 0.605821 0.347167 0.191351 -0.604145 -0.354394 -0.282260 -0.809272 -0.533230 0.226781 0.260461 0.241590 0.241591 0.217114 0.302803 0.335328 0.240177 0.224733 0.224738
chargesum: 0.00000
title: Mulliken charges with hydrogens summed into heavy atoms:
elementType: Cl O N C C C C C C C C
charge: -0.082842 -0.301037 -0.054344 0.605821 0.347167 0.191351 -0.377364 -0.354394 -0.021799 -0.108977 0.156418
polarizability: 1.50970634e+02 4.48922647e+00 1.22474181e+02 -1.45653034e-02 -7.03800696e-03 5.30420273e+01
1716.lowfreq: -1.4835 -0.0023 -0.0010 0.0017 4.9200 7.0336 75.3999 114.9399 119.9894
frequency: 75.3895 114.9365 119.9419 162.1428 171.2575 233.1793 237.1965 273.3837 283.7845 334.4232 337.5502 382.4743 389.9949 439.6667 472.7150 474.7091 549.1706 608.1112 615.7668 715.4959 722.2132 775.5681 834.1741 853.4037 969.2686 990.8900 1009.9873 1044.3980 1056.8736 1119.2358 1159.3851 1189.0094 1193.7604 1267.4498 1312.4314 1390.5701 1399.3626 1424.6481 1441.5223 1461.5953 1466.2613 1478.1677 1479.2240 1512.0477 1593.9314 1608.4229 1633.2786 2955.1281 2979.6544 3039.3432 3059.1732 3086.8410 3121.0390 3121.7735 3169.3250 3568.1293 3715.8171
redmass: 3.2699 4.6016 1.0657 3.4193 4.7388 1.4904 3.9145 2.2662 3.0948 5.6750 1.3838 3.0469 5.6098 2.3674 1.1644 5.2972 3.2363 5.8412 5.4055 5.7940 2.9529 5.1303 1.4979 1.5017 3.4352 1.7867 3.9392 1.5021 1.5376 1.2594 1.4225 3.8207 1.8525 1.3495 4.5667 5.5087 1.2219 4.0964 1.2072 1.0454 1.0490 1.1968 1.0840 3.2810 4.1622 2.1117 2.4474 1.0333 1.0365 1.1036 1.0975 1.0997 1.0912 1.0991 1.0911 1.0443 1.1046
irintensity: 4.6300 5.3860 1.2102 0.2122 3.2310 1.1322 2.6984 0.5716 4.3547 1.0207 137.8008 106.4326 3.0007 16.8097 67.6730 2.8303 4.7100 6.3059 0.4711 15.7227 0.2069 40.5653 15.7774 38.5200 23.1435 1.4373 54.2711 10.7205 3.3068 0.1502 3.8968 169.3897 16.8844 28.0098 33.0383 24.3276 16.2537 7.5423 17.1552 13.3979 13.7779 19.0547 53.4895 214.6709 6.1808 31.3892 218.7555 64.9983 30.6594 48.3898 17.3656 18.2953 21.5330 24.0663 2.5900 85.4299 34.1524
temp: 298.150 k
press: 1.00000 atm
elementType: 17 8 7 6 6 6 6 6 6 6 6 1 1 1 1 1 1 1 1 1 1
symmnumber: 1
zpe: 431819.6 jmol-1
zpe.correction: 0.164471 hartree
zpe.thermalcorrener: 0.176060 hartree
zpe.thermalcorrenthalpy: 0.177004 hartree
zpe.thermalcorrgfe: 0.127350 hartree
zpe.sumelectzpe: -900.057722 hartree
zpe.sumelectthermal: -900.046134 hartree
zpe.sumelectthermalent: -900.045190 hartree
zpe.sumelectthermalfe: -900.094844 hartree
dipole: 3.0202 0.9904 -0.0016
dipole: 3.1784
quadrupole: -66.3799 -58.8733 -76.3438
quadrupole: -5.2286 -0.0049 -0.0054
quadrupole: 0.8191 8.3257 -9.1448 -5.2286 -0.0049 -0.0054
hfenergy: -900.2221938 hartree
pointgroup: C01 [X(C8H10Cl1N1O1)]
dipole: 1.0969208 -0.6003912 0.0006447 debye
dipolederiv: -0.4601917 0.3082341 -0.0000843 0.3716182 -0.5340143 0.0000931 -0.0000839 0.0001007 -0.0800637 -1.4526065 -0.5370346 -0.000087 -0.48081 -0.6263776 -0.0000046 -0.0001363 -0.0000388 -0.2960754 -0.8526014 0.7076213 -0.0000091 0.7326584 -0.8553711 -0.0001586 0.0003172 -0.0005423 -0.7334249 0.1319921 0.0378255 0.0000383 0.2483946 0.0156381 0.0000407 0.0001822 0.0000744 0.0336512 0.5736053 -0.8459733 0.0000507 -1.0249058 0.7686271 -0.0000735 0.0001006 -0.0000444 0.1335951 1.1904256 0.3942916 0.0001426 0.5976861 -0.1098301 0.0000719 0.0001164 0.0001433 0.0088589 -0.1858001 0.3255258 -0.0000139 -0.048006 -0.0193769 -0.0000179 0.0000132 -0.0000012 -0.2649373 0.3128813 -0.3970333 0.0001349 -0.6554944 0.5750996 -0.0001739 0.0001347 -0.0001599 -0.1617807 -0.1003906 -0.0468687 -0.000017 0.1171164 -0.1405228 0.0000408 -0.0000622 0.000003 -0.1189301 -0.1251173 -0.0097104 -0.0000386 0.0261541 0.1268047 -0.0000253 -0.0002102 -0.0000872 0.0640889 0.4228488 0.1567194 -0.0000193 0.5000171 0.6281411 0.0000288 -0.0000829 -0.0000284 0.330699 0.0447805 -0.037955 0.0000001 -0.0349636 -0.1301222 0.0000323 -0.000003 0.000025 0.1668227 0.0952549 -0.0544305 -0.0000029 -0.0672427 -0.0292283 0.0000129 0.0000075 0.0000061 0.1664542 -0.0198405 -0.0115867 0.0623517 0.0277434 0.0682815 -0.0869917 0.1107947 -0.0453646 -0.036689 -0.019842 -0.0117298 -0.0623577 0.0274739 0.0684409 0.0868377 -0.1108406 0.045227 -0.0370473 0.0766695 0.0243532 -0.0000207 -0.0907917 -0.1591784 0.000174 0.0000639 0.0001761 0.106493 0.1467513 -0.044411 0.000013 -0.0662851 0.1889525 0.0001148 -0.0001271 0.0003631 0.3859826 0.2383715 -0.0528215 -0.0000605 0.0023818 0.207789 0.000045 -0.0002275 0.0001578 0.3881506 -0.163851 -0.0421767 -0.0000138 0.0109204 0.0765517 0.0000052 -0.0000227 -0.000001 0.123407 0.0733162 0.0686031 0.0939312 -0.0968268 -0.0601993 -0.0783689 0.0272123 -0.1072194 -0.0895851 0.0733441 0.0685576 -0.0939378 -0.0968385 -0.060105 0.0783174 -0.0271462 0.1072109 -0.0896697 unknown
polarizability: 148.4028886|-9.3129737|125.0419266|0.0130324|-0.0095833|53.0420273 unknown
InChI: InChI=1S/C8H10ClNO/c1-5-3-7(10)8(11-2)4-6(5)9/h3-4H,10H2,1-2H3
charge 0 multiplicity 1
21 atoms
Cl -2.461228 2.202955 -0.000738
O  2.479503 0.331851 0.000157
N  1.664051 -2.2157 0.000169
C  -1.7006 -0.507597 -0.000299
C  0.6806 -1.232691 0.000062
C  1.081683 0.142004 -0.000061
C  -0.707504 -1.521532 -0.000053
C  -1.246749 0.829741 -0.000419
C  0.122975 1.169902 -0.0003
C  -3.174717 -0.863342 -0.000557
C  2.968439 1.707789 -0.000105
H  -1.0296 -2.570392 0.000022
H  0.420287 2.222089 -0.000374
H  -3.688797 -0.447132 0.885683
H  -3.688123 -0.448472 -0.887832
H  -3.314129 -1.957955 0.000202
H  1.421763 -3.200793 0.000823
H  2.640111 -1.933117 0.000531
H  4.066043 1.632762 -0.000026
H  2.631147 2.253712 0.90339
H  2.631245 2.253319 -0.903876
