program: Gaussian 09
title: 000080778
version: EM64L-G09RevD.01
frameworkgroup: C1[X(C12H18N2O)]
method: RPBEPBE
basis: SDD
operation: Freq
keyword: #p
keyword: freq=noraman
keyword: PBEPBE/SDD
title: #p freq=noraman PBEPBE/SDD
converged: YES YES NO NO
title: Mulliken charges:
elementType: O N N C C C C C C C C C C C C H H H H H H H H H H H H H H H H H H
charge: -0.256253 -0.174621 -0.448142 0.514793 -0.391211 -0.395653 -0.630505 -0.410621 0.524482 -0.664169 -0.666098 -0.215556 -0.408417 0.203202 -0.803271 0.218120 0.225606 0.222016 0.219638 0.213048 0.226656 0.240923 0.214455 0.212586 0.237280 0.219085 0.211540 0.217213 0.306268 0.302235 0.236052 0.267460 0.231858
chargesum: 0.00000
title: Mulliken charges with hydrogens summed into heavy atoms:
elementType: O N N C C C C C C C C C C C C
charge: -0.256253 -0.174621 -0.145907 0.514793 0.052515 0.046002 -0.417457 -0.183965 0.524482 0.003795 0.001808 0.001657 -0.102149 0.203202 -0.067901
polarizability: 2.25449661e+02 -1.91782087e+00 1.58009894e+02 1.70137065e-01 7.72256574e+00 8.85135200e+01
1716.lowfreq: -80.9432 -5.4342 -0.0007 -0.0006 0.0005 3.9935 8.0486 39.4462 48.4612
frequency: -80.9383 39.3032 48.3845 79.6761 82.0997 84.3506 111.1927 138.5953 185.4727 206.7340 221.2761 236.6726 255.7558 298.8448 319.8383 350.6948 401.3231 418.5522 457.8285 511.8148 526.0202 544.0722 572.1447 605.4940 646.0645 651.7145 686.8897 720.7420 773.4061 783.2168 785.8282 828.5785 831.9782 880.5870 901.8090 919.3943 961.4449 974.3705 976.1030 999.5887 1028.4058 1031.9139 1072.2515 1078.2481 1094.9281 1098.3973 1155.2784 1188.0227 1206.4659 1211.8822 1244.6430 1280.1189 1293.9790 1320.2641 1342.6723 1353.0251 1373.7340 1382.9988 1384.5263 1387.7509 1395.2316 1418.6142 1452.0609 1465.9729 1467.2874 1468.7804 1474.1426 1482.7454 1488.8791 1494.7068 1505.2041 1533.6423 1587.8450 1624.1881 1635.0297 2980.0904 2981.0927 2981.9166 2984.9087 2989.4979 3030.5114 3038.0827 3069.6570 3075.4794 3076.2910 3089.2654 3091.1619 3128.5423 3130.6615 3134.2308 3166.8020 3208.7412 3519.3576
redmass: 1.0605 3.6371 5.1235 3.0141 3.2931 3.5277 3.2636 2.7420 1.9782 1.1189 1.6566 3.2152 3.6563 2.8840 3.1230 3.1929 2.8041 3.6001 3.0851 3.6446 2.9026 3.1559 3.0653 1.7689 2.0895 4.9981 1.7815 4.3179 1.3213 1.1530 1.2415 2.2684 2.8673 1.4009 3.1545 2.2052 2.5781 2.4189 1.8922 2.0545 1.6583 2.4852 2.1209 1.7988 1.6608 1.6429 1.7356 1.1089 2.7079 2.5922 1.6849 1.4624 1.3033 1.4440 1.2807 1.3404 1.2363 1.9355 1.2203 1.8620 2.6952 2.2673 1.1440 1.0472 1.0444 1.0476 1.0733 1.0616 1.2899 1.8239 1.1427 2.2680 5.1218 6.6320 4.9755 1.0389 1.0361 1.0572 1.0383 1.0606 1.1024 1.1020 1.0984 1.0995 1.0993 1.1007 1.1008 1.0893 1.0881 1.0977 1.0935 1.0949 1.0762
irintensity: 0.0063 0.2030 6.1072 1.3003 5.1362 0.7504 0.3458 2.9306 1.3777 0.5011 0.8911 4.2858 1.9188 0.1492 0.8543 0.1805 2.3129 6.6169 4.1948 9.3583 0.9801 12.7375 4.6664 26.6203 24.1926 2.8365 38.5599 0.0530 26.7920 5.7627 16.9827 63.5410 6.2040 14.8434 1.7919 3.0798 29.2008 3.1089 3.6102 0.8520 7.6852 30.3482 14.3860 20.4825 17.4351 6.6404 22.5412 15.8535 30.5189 17.4178 139.3481 22.2422 8.8580 35.6905 13.0536 78.6492 38.4132 12.8153 11.6456 88.4104 80.8808 237.8385 11.6344 5.6465 7.9218 19.3708 13.7240 8.5874 87.2896 201.4271 37.5818 66.5525 36.6977 529.3001 50.7383 35.9383 29.7395 47.7192 11.1435 45.1443 10.4040 16.5602 17.5159 38.7806 53.8011 19.2073 71.2078 27.9050 9.8650 8.9276 19.9271 8.3928 8.4100
temp: 298.150 k
press: 1.00000 atm
elementType: 8 7 7 6 6 6 6 6 6 6 6 6 6 6 6 1 1 1 1 1 1 1 1 1 1 1 1 1 1 1 1 1 1
symmnumber: 1
zpe: 734016.5 jmol-1
zpe.correction: 0.279572 hartree
zpe.thermalcorrener: 0.295038 hartree
zpe.thermalcorrenthalpy: 0.295983 hartree
zpe.thermalcorrgfe: 0.236281 hartree
zpe.sumelectzpe: -651.670999 hartree
zpe.sumelectthermal: -651.655532 hartree
zpe.sumelectthermalent: -651.654588 hartree
zpe.sumelectthermalfe: -651.714290 hartree
dipole: -3.9094 4.4560 0.7105
dipole: 5.9703
quadrupole: -89.0584 -83.8248 -94.8217
quadrupole: 13.2372 2.6921 2.5580
quadrupole: 0.1766 5.4102 -5.5867 13.2372 2.6921 2.5580
hfenergy: -651.9505707 hartree
pointgroup: C01 [X(C12H18N2O1)]
dipole: 1.5787124 -1.7211845 0.2498661 debye
polarizability: 225.4972436|-0.2363431|158.2768986|0.8917313|-6.110324|88.1989326 unknown
InChI: InChI=1S/C12H18N2O/c1-4-14(5-2)12-8-6-7-11(9-12)13-10(3)15/h6-9,13H,4-5H2,1-3H3
charge 0 multiplicity 1
33 atoms
O  -4.221713 0.776702 -0.069568
N  2.459454 -0.333026 0.037189
N  -2.410925 -0.708731 0.156318
C  1.199973 0.284378 -0.041328
C  3.702616 0.414607 -0.229447
C  2.605463 -1.754881 0.395075
C  -0.004281 -0.471205 0.085723
C  1.07194 1.695744 -0.252541
C  -1.277473 0.149561 0.013579
C  4.279947 1.130692 1.015341
C  2.505971 -2.718241 -0.813541
C  -0.201572 2.288825 -0.332036
C  -1.394697 1.546124 -0.200611
C  -3.770121 -0.391816 0.110846
C  -4.685343 -1.606487 0.297703
H  4.451297 -0.301687 -0.619502
H  3.527163 1.14399 -1.041869
H  3.590767 -1.883552 0.882934
H  1.851819 -2.022652 1.160207
H  0.039525 -1.557806 0.222834
H  1.957801 2.330762 -0.336063
H  3.559301 1.861682 1.421191
H  4.508976 0.402828 1.815025
H  5.214053 1.665826 0.760368
H  1.534241 -2.612638 -1.326737
H  3.299573 -2.502302 -1.551739
H  2.617971 -3.7695 -0.487169
H  -0.269092 3.371308 -0.492135
H  -2.378126 2.01193 -0.25878
H  -2.19024 -1.695422 0.312494
H  -4.554175 -2.337066 -0.522515
H  -5.728537 -1.259566 0.295552
H  -4.484557 -2.12358 1.254699
