program: Gaussian 09
title: 000080814
version: EM64L-G09RevD.01
frameworkgroup: C1[X(C12H12N2O6S)]
method: RPBEPBE
basis: SDD
operation: Freq
keyword: #p
keyword: freq=noraman
keyword: PBEPBE/SDD
title: #p freq=noraman PBEPBE/SDD
converged: YES YES NO NO
title: Mulliken charges:
elementType: S O O O O O O N N C C C C C C C C C C C C H H H H H H H H H H H H
charge: 0.992904 -0.275744 -0.197667 -0.567715 -0.211104 -0.502068 -0.501722 -0.281018 0.017411 -0.621906 0.439255 0.191713 0.062525 -0.324507 -0.347233 -0.078259 -0.223714 -0.205752 0.196627 -0.217102 -0.670655 0.300609 0.300509 0.312966 0.302894 0.284202 0.285608 0.236890 0.236521 0.220050 0.231221 0.231293 0.382967
chargesum: 0.00000
title: Mulliken charges with hydrogens summed into heavy atoms:
elementType: S O O O O O O N N C C C C C C C C C C C C
charge: 0.992904 -0.275744 -0.197667 -0.184748 -0.211104 -0.502068 -0.501722 -0.281018 0.017411 -0.020788 0.439255 0.191713 0.062525 -0.011540 -0.044339 -0.078259 0.060488 0.079857 0.196627 0.256309 0.011910
polarizability: 3.53152957e+02 3.71004850e-01 1.86338366e+02 -5.89473397e-01 6.24880238e-01 1.05052924e+02
1716.lowfreq: -5.8038 -0.0022 -0.0021 -0.0020 2.7356 5.0884 23.1864 27.4812 47.4649
frequency: 22.6978 27.3631 47.4098 49.9031 55.8539 64.6621 90.0864 101.2681 116.5518 141.4083 149.3656 168.3959 177.8098 189.9761 234.6723 246.2966 271.3608 285.0981 296.2274 318.9983 329.3941 351.1008 371.6001 392.0873 411.2104 416.1117 435.2437 442.0084 492.4930 519.7861 560.8659 589.8847 595.3079 617.1114 672.8362 689.9167 715.9798 737.6884 778.8880 798.8534 824.9340 834.2707 853.6303 864.8907 906.1441 925.7635 940.3714 967.2756 988.6760 991.9202 1002.4146 1021.9536 1031.4250 1045.9300 1059.4774 1093.6939 1105.5671 1112.8930 1119.5811 1129.2887 1136.1613 1185.1354 1194.8749 1250.7427 1289.0449 1300.1536 1347.6880 1373.4919 1389.0844 1398.8513 1404.5555 1413.9368 1465.1555 1472.8935 1476.6859 1485.1902 1523.1996 1591.5752 1594.1527 1632.4899 1662.8658 2998.7434 3013.6863 3030.4634 3073.0855 3081.5758 3095.2457 3110.3063 3164.4445 3164.9461 3194.5816 3196.1548 3480.8713
redmass: 5.7420 7.5313 4.4356 5.8585 4.1857 3.0588 4.7267 6.0786 4.7599 7.8325 2.6367 2.4508 2.6163 5.8304 5.2307 1.3793 4.0756 5.4868 5.4365 8.4458 8.3908 4.7831 7.5988 7.4460 8.2032 3.0536 6.9003 2.4007 7.4682 4.0292 8.0204 4.7004 4.4869 7.0715 9.2420 7.3580 7.0540 3.9918 6.5766 1.1027 4.5197 12.7476 1.2422 1.5118 6.3398 2.7169 5.9072 17.4199 2.7501 1.7346 1.3506 2.3314 9.2065 1.2918 2.0078 5.1843 1.1929 2.2468 2.8522 1.7007 1.4700 1.2128 1.7900 1.1306 3.7673 1.2864 1.8843 2.5529 7.0512 1.1896 1.2795 3.0930 1.0397 1.0638 2.5622 1.0697 8.4964 8.0797 5.9504 12.0307 12.2124 1.0360 1.0583 1.0627 1.1067 1.0989 1.0985 1.1028 1.0914 1.0913 1.0947 1.0961 1.0661
irintensity: 0.4775 1.3150 0.3449 0.0484 0.9407 1.4850 0.4930 0.3544 0.6970 1.1092 18.1553 34.3543 23.4564 3.7181 12.6246 0.3938 35.1559 18.5771 28.2133 19.9125 1.5536 42.3151 14.8786 2.0526 33.7521 1.2098 15.4246 0.1205 9.3809 32.2744 181.9631 7.9173 9.4592 0.9289 76.4653 11.5266 7.7020 0.6173 25.6040 3.5408 21.0232 87.9467 0.5390 74.4897 21.7416 3.1290 15.0793 80.3677 2.8200 5.3795 0.3619 24.1891 497.2619 47.6357 98.3770 153.7059 1.8098 9.7533 28.3722 12.2667 6.0929 100.6276 334.2586 0.0836 297.7190 4.2124 1.8591 0.5740 6.0534 44.1157 15.0071 19.3672 13.6444 7.3176 159.1985 10.8306 119.8159 1.0054 108.0606 218.0005 199.3248 20.1704 14.8766 3.0813 5.6318 0.2948 26.6697 40.4292 2.2072 4.3683 5.1495 1.7978 45.0492
temp: 298.150 k
press: 1.00000 atm
elementType: 16 8 8 8 8 8 8 7 7 6 6 6 6 6 6 6 6 6 6 6 6 1 1 1 1 1 1 1 1 1 1 1 1
symmnumber: 1
zpe: 604029.9 jmol-1
zpe.correction: 0.230063 hartree
zpe.thermalcorrener: 0.251213 hartree
zpe.thermalcorrenthalpy: 0.252158 hartree
zpe.thermalcorrgfe: 0.177660 hartree
zpe.sumelectzpe: -1421.650606 hartree
zpe.sumelectthermal: -1421.629456 hartree
zpe.sumelectthermalent: -1421.628511 hartree
zpe.sumelectthermalfe: -1421.703009 hartree
dipole: -8.1785 1.1975 1.4380
dipole: 8.3899
quadrupole: -112.3083 -143.1604 -130.0788
quadrupole: -3.0185 12.4112 -1.7228
quadrupole: 16.2075 -14.6445 -1.5630 -3.0185 12.4112 -1.7228
hfenergy: -1421.8806689 hartree
pointgroup: C01 [X(C12H12N2O6S1)]
dipole: -3.1881871 0.5358129 0.6661997 debye
polarizability: 352.8291881|-3.1396204|186.3863936|-8.108692|1.2644992|105.3286651 unknown
InChI: InChI=1S/C12H12N2O6S/c1-2-20-12(16)10-7-11(15)14(13-10)8-3-5-9(6-4-8)21(17,18)19/h3-6,17H,2,7H2,1H3
charge 0 multiplicity 1
33 atoms
S  5.35904 -0.60611 -0.210226
O  -5.037827 -0.196277 0.259634
O  -0.735793 2.978823 0.141719
O  5.646593 -0.691704 1.62571
O  -3.835047 -2.208085 0.179712
O  5.594366 -2.080703 -0.833549
O  6.158289 0.673603 -0.795217
N  -0.578817 0.582114 0.089883
N  -1.465994 -0.518801 0.107156
C  -2.748391 1.468766 0.198127
C  0.822116 0.319062 0.025988
C  -1.265043 1.844395 0.142743
C  -2.70019 -0.036413 0.168256
C  1.753657 1.392424 0.005405
C  1.261447 -1.03161 -0.023591
C  3.534431 -0.234041 -0.099958
C  3.1325 1.109122 -0.054975
C  2.637573 -1.314816 -0.084156
C  -3.864181 -0.957919 0.200636
C  -6.316086 -0.97865 0.298627
C  -7.45451 0.033279 0.343903
H  -3.300455 1.89938 -0.655646
H  -3.226501 1.866982 1.110249
H  1.402907 2.425241 0.039158
H  0.524277 -1.836585 -0.01085
H  3.871799 1.915279 -0.081745
H  3.002596 -2.345019 -0.133848
H  -6.349906 -1.621473 -0.599399
H  -6.288341 -1.63196 1.189294
H  -8.421983 -0.499784 0.373894
H  -7.384107 0.670923 1.241501
H  -7.445296 0.681608 -0.548721
H  6.616275 -0.898051 1.768587
