program: Gaussian 09
title: 000080774
version: EM64L-G09RevD.01
frameworkgroup: C1[X(C7H8N2O6S)]
method: RPBEPBE
basis: SDD
operation: Freq
keyword: #p
keyword: freq=noraman
keyword: PBEPBE/SDD
title: #p freq=noraman PBEPBE/SDD
converged: NO NO NO NO
title: Mulliken charges:
elementType: S O O O O O O N N C C C C C C C H H H H H H H H
charge: 1.036756 -0.293291 -0.534635 -0.514716 -0.477215 -0.202086 -0.258461 0.023169 -0.650872 -0.353761 0.587081 -0.395175 0.372542 0.221828 -0.472043 -0.528024 0.313699 0.304395 0.357312 0.335154 0.399068 0.237471 0.252011 0.239794
chargesum: 0.00000
title: Mulliken charges with hydrogens summed into heavy atoms:
elementType: S O O O O O O N N C C C C C C C
charge: 1.036756 -0.293291 -0.135567 -0.514716 -0.477215 -0.202086 -0.258461 0.023169 0.041594 -0.353761 0.587081 -0.081476 0.372542 0.221828 -0.167648 0.201251
polarizability: 2.04251933e+02 -1.90888869e+01 1.86870803e+02 1.92288128e+00 3.24790487e+00 7.82094217e+01
1716.lowfreq: -7.1672 -5.4993 0.0017 0.0019 0.0020 5.4319 47.3111 52.7239 87.8621
frequency: 47.3103 52.7210 87.8578 117.4683 131.9267 146.5967 172.9098 182.9501 196.9624 218.7536 241.2724 253.4358 264.0050 300.0685 324.1336 337.7201 360.7383 394.1056 417.5673 445.9524 472.0966 501.7614 505.2508 547.8321 577.4897 581.0827 594.6140 618.6643 632.1075 705.7307 737.6059 765.2298 813.8073 840.0772 898.8085 901.5695 909.8630 956.4888 991.2659 1044.1843 1102.3393 1118.0270 1139.2628 1161.5434 1200.4182 1224.3854 1255.5393 1305.1494 1353.1977 1409.9795 1441.2509 1454.5821 1469.4784 1473.3575 1530.6981 1568.1011 1604.6735 1638.1279 2979.0179 3074.8743 3131.7421 3141.5527 3180.9131 3335.8365 3539.7518 3686.5369
redmass: 6.8445 7.1047 9.0575 4.6333 7.6010 5.2054 4.5568 7.9972 3.2478 3.6021 2.6486 3.2109 5.1724 5.0852 10.8988 5.8365 7.8877 6.9457 6.9976 2.5148 5.4071 1.2819 1.3317 6.1109 1.2284 5.7010 5.1596 8.9244 7.3771 9.0537 9.8403 2.7351 4.9988 14.7729 1.4258 1.8364 7.9741 8.5187 6.5380 1.5490 2.0786 1.2574 1.3719 1.3626 3.6564 5.3046 1.5528 3.5039 6.4975 4.2483 1.2158 6.5982 1.0488 1.0890 4.8238 7.7814 2.2078 1.9488 1.0322 1.1051 1.0915 1.1012 1.0908 1.0646 1.0453 1.1045
irintensity: 0.8343 0.7617 0.7326 4.7386 6.3978 0.9772 2.9855 5.0818 12.3562 4.6508 4.6535 1.5111 8.9163 10.1857 6.8029 3.8142 2.1342 4.2568 26.7922 33.8981 12.3713 47.3509 200.5464 32.8741 221.3980 111.4215 9.9558 32.3738 8.5445 1.6783 18.0483 1.2327 6.9954 88.9395 53.0670 2.8896 4.8987 70.6062 67.7974 5.0938 34.8804 0.0509 257.8422 3.0257 241.6880 511.9099 26.3452 128.6496 95.8162 34.9913 4.4833 0.4721 18.1206 41.6857 156.3215 37.0275 23.1967 450.1260 39.9329 30.9143 18.0025 14.9095 5.6143 76.6443 222.3996 52.1008
temp: 298.150 k
press: 1.00000 atm
elementType: 16 8 8 8 8 8 8 7 7 6 6 6 6 6 6 6 1 1 1 1 1 1 1 1
symmnumber: 1
zpe: 417558.4 jmol-1
zpe.correction: 0.159040 hartree
zpe.thermalcorrener: 0.175065 hartree
zpe.thermalcorrenthalpy: 0.176009 hartree
zpe.thermalcorrgfe: 0.115960 hartree
zpe.sumelectzpe: -1228.979245 hartree
zpe.sumelectthermal: -1228.963220 hartree
zpe.sumelectthermalent: -1228.962276 hartree
zpe.sumelectthermalfe: -1229.022325 hartree
dipole: 11.4159 -2.3466 -1.0121
dipole: 11.6985
quadrupole: -94.8370 -100.1364 -106.0149
quadrupole: -6.6533 2.5158 -2.4503
quadrupole: 5.4924 0.1930 -5.6854 -6.6533 2.5158 -2.4503
hfenergy: -1229.1382845 hartree
pointgroup: C01 [X(C7H8N2O6S1)]
dipole: -4.5959382 -0.2347335 0.0742376 debye
dipolederiv: 1.8379036 -0.2997467 0.0666151 -0.4375693 1.40005 0.0744715 -0.013305 0.1233299 1.4405258 -1.6169131 0.476228 -0.1497646 0.5030286 -0.5014173 0.0591529 -0.1506903 0.0546051 -0.3132987 -0.7584952 0.0196457 -0.1034965 0.0170269 -0.5232821 -0.2981132 -0.1753454 -0.150993 -0.7013118 -0.578121 0.0674105 0.0028714 0.1409752 -0.6129875 0.0286998 0.0126655 0.0622364 -0.4516146 -0.6367787 0.0803743 0.0458727 0.112061 -0.453959 0.0732512 0.1317675 -0.0108162 -0.5750294 -0.3495663 0.2278177 -0.0799673 -0.1070722 -1.1247691 0.1293889 -0.0350425 0.1708337 -0.2583083 -1.1212895 -0.2889844 -0.1908425 0.0179078 -0.4407961 0.0279052 -0.3171404 0.0003662 -0.2674425 1.424264 0.5488566 0.2536639 0.5975663 1.8732748 -0.1745184 0.2357968 -0.1619093 0.266398 -0.9939916 -0.8225494 0.0625911 -0.8150516 -0.9940534 -0.0253002 0.0677869 -0.0189293 -0.6295948 -0.1240917 0.202788 -0.0368743 0.411168 0.3901006 -0.0148861 0.0089315 -0.086167 -0.1819261 -0.5802543 -0.5102309 -0.0145263 -0.75382 -0.7560655 0.0321352 -0.0006609 0.0056146 0.0333938 -0.6007083 -0.6458522 0.0431396 0.1999745 -0.2433513 0.0209636 -0.0697134 -0.0478666 -0.1191618 0.8349918 1.0029027 -0.0596628 0.9551561 0.9510449 -0.0171331 -0.0776079 -0.013122 0.1485314 1.4884545 -0.3895304 0.147692 -0.5759508 -0.4784253 0.0105835 0.1711026 0.0302044 0.069199 0.0049907 0.4712928 -0.0338468 0.054442 0.0550152 -0.026072 0.038968 0.0562842 -0.1204416 0.4922815 -0.1691952 0.0335179 -0.5566408 0.5412201 -0.0659538 0.08048 -0.0410652 0.3165464 0.1555638 -0.0032482 -0.000002 -0.0350703 0.0723368 0.0051202 0.0236317 0.0133211 0.1610963 0.0884001 0.0143145 -0.0025062 0.0723549 0.0722775 0.0136357 -0.027315 0.0155442 0.1695045 0.3354521 0.1208197 -0.0142182 -0.0289424 0.1963476 0.0177846 0.0008963 0.027135 0.3743644 0.153088 0.0198996 -0.0191724 0.1296361 0.3112543 0.017999 -0.032508 0.0087725 0.3746296 0.5303364 -0.0266524 0.0371606 -0.0887795 0.2308525 0.103362 0.1485711 -0.0233787 0.2586737 0.0799331 -0.0621512 -0.0720688 0.1105862 -0.0428157 -0.0579016 -0.0336566 -0.0875786 -0.0581571 -0.125938 0.0239556 -0.0245789 -0.0280526 0.0859052 0.0019757 -0.0193297 0.0061684 0.1285757 0.0604881 -0.0581646 0.1084033 0.1050658 -0.007757 0.0634493 0.0317172 0.0674104 -0.0651518 unknown
polarizability: 208.5807584|16.6738877|180.6609761|9.9094486|-10.0572944|80.0904232 unknown
InChI: InChI=1S/C7H8N2O6S/c1-15-6-3-5(9(10)11)7(2-4(6)8)16(12,13)14/h2-3,12H,8H2,1H3
charge 0 multiplicity 1
24 atoms
S  2.373053 -1.3161 0.063119
O  -3.578809 -0.025314 -0.301507
O  3.053676 -0.613153 1.600419
O  2.28613 -2.899156 0.359567
O  3.145799 -0.779842 -1.246697
O  0.514649 2.951997 -0.395022
O  2.241605 1.638682 0.293433
N  1.001407 1.800359 -0.070618
N  -2.691112 -2.51204 0.036001
C  0.554734 -0.700296 0.057566
C  0.119058 0.638588 -0.094346
C  -0.358143 -1.757799 0.097666
C  -1.75235 -1.511413 -0.011542
C  -2.1931 -0.151718 -0.189311
C  -1.273933 0.897898 -0.227133
C  -4.129154 1.32295 -0.505673
H  0.024833 -2.778862 0.211736
H  -1.576934 1.940893 -0.346424
H  -3.675734 -2.268375 -0.060337
H  -2.422631 -3.48435 0.164819
H  3.054266 0.380812 1.426097
H  -3.895156 1.975069 0.356237
H  -5.216061 1.182033 -0.585537
H  -3.735393 1.768936 -1.437714
