program: Gaussian 09
title: 000000474
version: EM64L-G09RevD.01
frameworkgroup: C1[X(C12H19N6O7P)]
method: RPBEPBE
basis: SDD
operation: Freq
keyword: #p
keyword: freq=noraman
keyword: PBEPBE/SDD
title: #p freq=noraman PBEPBE/SDD
converged: NO YES NO NO
title: Mulliken charges:
elementType: P O O O O O O O N N N N N N C C C C C C C C C C C C H H H H H H H H H H H H H H H H H H H
charge: 1.399714 -0.292746 -0.434012 -0.458776 -0.516966 -0.440521 -0.664207 -0.583501 -0.185583 -0.085885 -0.155199 -0.063386 -0.606027 -0.149585 -0.122718 -0.182956 -0.096500 -0.082161 -0.352614 0.225834 -0.197379 -0.102559 0.171833 -0.338997 -0.566252 -0.576861 0.242525 0.225926 0.264525 0.295578 0.273431 0.226622 0.384240 0.409599 0.291550 0.250582 0.336158 0.348373 0.414132 0.239145 0.241546 0.248648 0.242529 0.293641 0.229261
chargesum: 0.00000
title: Mulliken charges with hydrogens summed into heavy atoms:
elementType: P O O O O O O O N N N N N N C C C C C C C C C C C C
charge: 1.399714 -0.292746 -0.049772 -0.049177 -0.516966 -0.440521 -0.250075 -0.583501 -0.185583 -0.085885 -0.155199 -0.063386 0.078503 -0.149585 0.119808 0.042970 0.168025 0.213418 0.147438 0.225834 0.094170 -0.102559 0.171833 -0.088415 0.163088 0.188570
polarizability: 2.85576013e+02 9.77411803e-01 2.23181444e+02 2.64621484e+01 9.15511329e-01 1.58819608e+02
1716.lowfreq: -9.0043 -6.7099 -5.2125 -0.0011 -0.0006 -0.0005 11.1967 21.5989 35.6437
frequency: 11.1433 21.1313 35.6224 46.0428 54.4795 79.5379 83.5917 88.8416 103.4853 116.4433 128.4006 143.6770 169.6539 171.4803 180.7068 202.0780 208.8844 224.8885 233.6299 247.0967 257.8537 260.6511 279.1069 280.5529 287.0146 304.9959 314.2913 329.6272 348.8366 385.2761 406.1690 421.1741 451.5128 460.9497 494.7597 516.9962 519.8293 533.4699 550.7759 557.9849 564.8372 567.7170 606.3225 615.1380 628.4690 644.6955 664.1837 675.1267 709.7248 739.5887 751.3629 785.2500 792.5889 813.1444 830.2106 844.4760 846.0078 865.4420 877.9491 930.0162 931.3050 961.2108 975.3217 977.2078 987.8572 998.5768 1003.9258 1022.4792 1032.0104 1058.4812 1077.7072 1082.5978 1093.2095 1098.3356 1110.4615 1147.3150 1162.2330 1180.4674 1183.8742 1188.7178 1203.9363 1219.7626 1228.7702 1252.1640 1254.4979 1270.8583 1282.3258 1294.3221 1314.5698 1324.6527 1330.3507 1344.1900 1354.4911 1371.3700 1374.1819 1379.4608 1405.5883 1423.1037 1431.7834 1437.5472 1442.7624 1449.2354 1454.7701 1468.0143 1471.3222 1481.2921 1488.8089 1537.7516 1581.1099 1636.2282 2922.0745 2942.0330 2971.8801 2976.8244 2986.1192 2996.4536 3002.7733 3005.5633 3081.2357 3084.2366 3087.0498 3108.7208 3117.4691 3121.3924 3171.4661 3261.1811 3537.5474 3578.2166 3692.1246
redmass: 6.5077 6.6047 6.0874 6.0473 6.6204 4.2229 4.4578 5.3262 5.6121 5.8437 6.0265 4.4040 4.7729 5.2068 3.3315 1.0679 5.4637 2.8473 4.1585 1.2740 3.6327 4.8379 3.5554 2.6772 4.9160 4.3464 4.2752 6.6517 7.2433 3.6001 5.6148 3.7479 3.7423 4.6031 3.8567 7.3564 5.5255 1.2666 3.6218 1.0783 3.9778 4.5841 7.4997 6.2978 6.4819 5.1585 9.2761 6.5434 7.2668 10.6846 13.3061 3.9789 5.5808 1.2431 3.0655 1.3073 1.2669 8.1257 3.5281 1.4327 6.0689 2.6686 2.7055 2.0837 2.0122 3.8579 5.0245 5.3058 4.3395 4.7563 4.1698 1.2746 3.2827 3.1918 2.6293 4.7351 1.6053 1.7459 2.6950 1.2895 1.6822 2.3561 1.1623 1.5282 1.2490 1.5026 1.8995 3.6720 1.3426 2.7912 1.3422 1.3524 1.2845 1.9000 1.4424 5.3297 1.1378 1.1482 2.8754 1.1089 1.0589 1.2003 1.0409 1.0636 3.9540 1.3564 1.0550 8.4121 1.8329 2.8120 1.0769 1.0788 1.0844 1.0346 1.0386 1.0831 1.0708 1.0823 1.1007 1.0678 1.0986 1.1000 1.1012 1.1026 1.0925 1.0989 1.0444 1.0659 1.1056
irintensity: 1.5144 0.8707 0.9551 1.6187 0.2287 2.3393 1.8313 2.2626 5.8530 6.1746 7.9196 7.8058 14.1462 9.2065 66.1120 3.5965 3.2192 11.3586 3.1074 1.2906 3.9126 7.3587 13.2737 25.4226 4.9187 10.9614 38.1251 4.1017 13.5200 16.5441 31.4727 3.7074 20.3997 33.5823 7.9968 5.5529 17.5827 238.0218 10.6367 9.2054 17.9150 7.7461 32.7967 5.4668 9.4396 46.4615 13.5765 58.0337 18.8611 164.4999 329.9145 15.8512 14.4137 145.4397 26.8075 22.9762 35.4731 4.1946 12.3265 6.7087 202.9602 29.1241 157.8312 53.0627 18.7169 30.3214 19.1787 113.1964 15.5950 12.9803 7.2166 3.3479 96.1738 71.9933 3.3198 25.4449 13.4334 64.7963 1.5467 1.0056 9.8938 23.9929 24.1696 6.7075 2.8776 44.1315 151.9037 19.0647 12.4442 11.8815 15.6895 84.9225 23.1279 34.8165 13.7208 11.1411 9.2105 11.0441 42.9522 18.9628 30.5034 58.3314 12.9239 10.0852 19.7884 76.8220 30.7986 47.3623 32.2738 648.2784 911.5467 424.4798 19.3821 13.3752 44.7523 9.2367 10.9517 50.2940 0.8428 681.8472 8.9916 3.2466 13.3398 2.0678 11.7154 3.8355 140.2033 108.2719 52.4554
temp: 298.150 k
press: 1.00000 atm
elementType: 15 8 8 8 8 8 8 8 7 7 7 7 7 7 6 6 6 6 6 6 6 6 6 6 6 6 1 1 1 1 1 1 1 1 1 1 1 1 1 1 1 1 1 1 1
symmnumber: 1
zpe: 883393.0 jmol-1
zpe.correction: 0.336467 hartree
zpe.thermalcorrener: 0.362619 hartree
zpe.thermalcorrenthalpy: 0.363563 hartree
zpe.thermalcorrgfe: 0.278649 hartree
zpe.sumelectzpe: -1662.920703 hartree
zpe.sumelectthermal: -1662.894550 hartree
zpe.sumelectthermalent: -1662.893606 hartree
zpe.sumelectthermalfe: -1662.978520 hartree
dipole: -2.3834 -0.2025 -2.3838
dipole: 3.3770
quadrupole: -129.9366 -164.6184 -158.4557
quadrupole: -21.8218 15.5022 7.0302
quadrupole: 21.0669 -13.6148 -7.4521 -21.8218 15.5022 7.0302
hfenergy: -1663.2571691 hartree
pointgroup: C01 [X(C12H19N6O7P1)]
dipole: 0.9729014 0.6657679 0.6127206 debye
polarizability: 287.4219462|16.2797902|180.2855773|14.0658838|-31.6504507|199.8695411 unknown
InChI: InChI=1S/C12H19N6O7P/c1-17(2)25-26(21,22)23-3-6-8(19)9(20)12(24-6)18-5-16-7-10(13)14-4-15-11(7)18/h4-6,8-9,12,19-21H,3,13H2,1-2H3
charge 0 multiplicity 1
45 atoms
P  4.154713 -1.550785 0.689942
O  0.072463 0.368089 1.548348
O  -1.078496 2.092444 -1.459814
O  1.703097 0.604358 -1.755321
O  3.374254 -0.563352 1.886767
O  5.128585 -0.475405 -0.313102
O  5.38237 -2.172516 1.690188
O  3.276568 -2.590232 -0.115205
N  -2.205679 0.0285 0.858964
N  -3.70321 -1.491867 1.703843
N  -3.560223 0.913562 -1.039666
N  -5.763538 -0.157361 -1.171956
N  -6.473327 -1.830225 0.336702
N  4.380572 0.016658 -1.567571
C  -0.513175 0.970369 -0.756159
C  1.009437 1.080191 -0.582223
C  -1.014112 0.897024 0.722895
C  1.27062 0.186018 0.664021
C  2.524015 0.583137 1.459727
C  -3.340678 0.110048 0.049437
C  -2.479872 -0.941508 1.837708
C  -4.253541 -0.83563 0.587373
C  -5.510165 -0.953829 -0.076198
C  -4.799034 0.713354 -1.586123
C  5.0744 1.302983 -1.85464
C  4.601985 -1.007464 -2.634392
H  -0.727157 0.002787 -1.259777
H  1.258973 2.141536 -0.3545
H  -1.272484 1.913821 1.078155
H  1.32142 -0.873453 0.339987
H  2.222291 1.052199 2.408799
H  3.159487 1.285242 0.886212
H  -2.069755 1.880885 -1.55102
H  2.679951 0.377842 -1.551833
H  -1.744766 -1.200734 2.593922
H  -5.046114 1.32123 -2.460863
H  -7.352175 -1.877182 -0.175096
H  -6.300934 -2.430158 1.141007
H  5.398323 -1.775606 2.599577
H  6.158239 1.159233 -2.025757
H  4.922347 1.993688 -1.010873
H  4.60472 1.731184 -2.757373
H  4.094857 -0.637726 -3.543565
H  4.126944 -1.949699 -2.322251
H  5.678804 -1.163048 -2.836891
