program: Gaussian 09
title: 000081296
version: EM64L-G09RevD.01
frameworkgroup: C1[X(C13H19NO2S2)]
method: RPBEPBE
basis: SDD
operation: Freq
keyword: #p
keyword: freq=noraman
keyword: PBEPBE/SDD
title: #p freq=noraman PBEPBE/SDD
converged: YES YES NO NO
title: Mulliken charges:
elementType: S S O O N C C C C C C C C C C C C C H H H H H H H H H H H H H H H H H H H
charge: 0.205806 0.191472 -0.360346 -0.256543 -0.369035 -0.956947 0.421672 0.211526 -0.284965 -0.321072 -0.582491 -0.567692 -0.245474 -0.222628 -0.656999 -0.663051 0.272553 -0.603237 0.334699 0.268645 0.251431 0.267724 0.282854 0.243904 0.250718 0.229437 0.230050 0.229890 0.229092 0.218990 0.224784 0.231110 0.223438 0.333218 0.272159 0.232413 0.232896
chargesum: 0.00000
title: Mulliken charges with hydrogens summed into heavy atoms:
elementType: S S O O N C C C C C C C C C C C C C
charge: 0.205806 0.191472 -0.360346 -0.256543 -0.035817 -0.622248 0.421672 0.211526 -0.016320 -0.070354 -0.063337 -0.040934 -0.016037 0.007422 0.020972 0.016282 0.272553 0.134231
polarizability: 2.08947559e+02 3.23276025e+00 1.83733348e+02 -4.17360575e+00 -4.07876365e+00 1.86029708e+02
1716.lowfreq: -9.9084 -4.8013 0.0014 0.0017 0.0026 8.1334 12.3961 16.8777 28.7298
frequency: 11.9625 16.0950 28.4849 31.3160 39.1433 50.1195 67.5510 69.5871 74.7964 97.5704 102.6948 140.2020 147.5050 164.4434 199.7244 206.3435 232.8142 236.5599 240.5333 253.0584 301.2067 336.5496 354.2209 356.7782 446.8728 470.1140 522.8773 571.7421 588.5249 603.4697 618.5368 625.4899 652.3501 678.7382 688.1391 713.6439 758.7099 771.0981 782.4930 789.1105 792.1548 833.6342 864.0369 887.5176 948.0562 983.8286 994.6827 996.4016 1028.9380 1033.5336 1035.2831 1061.4177 1064.9966 1070.4350 1081.6462 1126.8650 1145.7420 1156.3571 1159.5873 1169.3631 1190.8245 1219.9559 1230.2521 1238.7754 1243.5016 1277.9850 1282.3410 1288.2336 1386.8827 1393.2497 1395.5533 1432.0049 1435.7158 1457.4332 1459.2164 1464.0275 1470.0873 1470.5230 1473.0239 1482.6438 1483.7181 1484.4485 1513.8358 1587.2502 1607.3909 1703.1605 2982.9248 2984.4661 2984.7391 3012.0905 3015.0720 3062.0937 3073.5446 3074.6981 3078.0532 3078.4814 3080.4610 3100.7723 3101.3086 3115.2439 3133.1769 3146.2990 3160.0152 3173.3766 3573.5225
redmass: 4.5237 3.9624 4.6291 3.3463 4.2690 2.2345 2.3343 3.2823 3.6965 5.3802 1.1459 4.2064 4.2856 4.3169 4.3515 6.0072 1.5042 1.1914 2.1343 4.4453 4.5541 5.0414 5.1062 4.6232 6.5793 3.7290 4.4912 6.2118 1.1253 6.7780 4.5675 4.7985 5.5372 5.4564 8.9429 5.6203 2.8704 1.6615 4.0334 1.1626 1.1166 4.6414 1.6275 4.2855 1.3931 1.3293 1.7574 1.8530 1.2103 2.1960 1.2152 2.2794 3.8850 2.3261 3.0422 1.2826 1.7176 1.1501 1.9308 1.0758 1.6404 2.7942 1.7900 1.2364 1.2435 1.2591 1.2652 1.3422 7.4762 1.2043 1.2045 1.1703 2.1850 1.4587 1.0917 1.0902 1.0423 1.0435 2.1397 1.0479 1.0441 1.0484 1.3883 6.7682 6.7394 9.6194 1.0353 1.0353 1.0352 1.0576 1.0573 1.1028 1.1025 1.1035 1.0892 1.0961 1.0989 1.1054 1.1055 1.0985 1.0855 1.0902 1.0955 1.0999 1.0772
irintensity: 0.9420 0.3381 0.8757 1.1450 4.9001 1.6473 1.1574 1.2325 1.7882 2.6431 0.3032 4.1326 1.5380 0.6802 0.2773 1.0449 0.2094 0.0704 1.4063 5.5861 2.4336 1.6438 12.0193 11.9723 2.3700 9.9210 0.4951 2.5657 128.7284 0.8248 4.6020 0.4247 1.2849 18.2621 38.2376 0.4129 28.7303 21.5338 10.9999 8.0085 11.2834 20.9082 4.0198 60.7301 0.6518 0.0665 24.1938 6.5403 0.9013 4.8343 1.5113 8.5900 72.2700 19.4680 253.6795 0.1298 104.1515 22.5683 203.9190 1.1860 114.5242 1.6576 5.7513 0.9738 1.2551 11.9742 10.3133 1.5329 1.4904 17.3058 16.9813 26.8936 58.8386 161.4268 11.4909 8.0294 15.1004 15.2163 13.5319 6.5556 14.6888 7.6394 128.3535 3.1345 2.2647 258.6907 77.6004 61.4284 15.7968 16.3440 18.5205 32.2487 4.7623 0.2257 7.7365 25.0631 19.9207 15.2073 62.7574 3.7780 1.4881 10.3879 16.9110 13.5824 37.2364
temp: 298.150 k
press: 1.00000 atm
elementType: 16 16 8 8 7 6 6 6 6 6 6 6 6 6 6 6 6 6 1 1 1 1 1 1 1 1 1 1 1 1 1 1 1 1 1 1 1
symmnumber: 1
zpe: 778039.3 jmol-1
zpe.correction: 0.296340 hartree
zpe.thermalcorrener: 0.318126 hartree
zpe.thermalcorrenthalpy: 0.319071 hartree
zpe.thermalcorrgfe: 0.240124 hartree
zpe.sumelectzpe: -1506.729829 hartree
zpe.sumelectthermal: -1506.708042 hartree
zpe.sumelectthermalent: -1506.707098 hartree
zpe.sumelectthermalfe: -1506.786044 hartree
dipole: 2.4280 -3.5780 -1.6404
dipole: 4.6247
quadrupole: -117.7283 -118.3965 -112.9085
quadrupole: 2.4238 -14.4670 5.0641
quadrupole: -1.3839 -2.0521 3.4359 2.4238 -14.4670 5.0641
hfenergy: -1507.0261687 hartree
pointgroup: C01 [X(C13H19N1O2S2)]
dipole: 0.9670265 1.4441948 0.5382621 debye
polarizability: 209.5573594|-2.8748169|183.3889994|2.7007978|-3.7283557|185.764256 unknown
InChI: InChI=1S/C13H19NO2S2/c1-4-17-12(18-5-2)10-8-6-7-9-11(10)16-13(15)14-3/h6-9,12,14H,4-5H2,1-3H3
charge 0 multiplicity 1
37 atoms
S  -2.794692 -0.586294 1.556986
S  -0.885817 -2.726218 0.640702
O  0.99759 1.124103 0.422823
O  2.978391 0.274563 -0.594095
N  2.978435 1.358347 1.497489
C  -1.063962 -0.833572 0.798827
C  -0.875303 -0.123974 -0.520627
C  0.183526 0.798713 -0.709048
C  -1.738737 -0.366522 -1.621293
C  0.404489 1.446621 -1.943231
C  -2.846299 1.315013 1.561661
C  0.987918 -2.795307 0.313705
C  -1.539093 0.275035 -2.858878
C  -0.460854 1.180347 -3.023206
C  -4.170398 1.769845 2.193009
C  1.383192 -4.24523 -0.000617
C  2.407511 0.863784 0.351228
C  4.413857 1.238672 1.76807
H  -0.323521 -0.495973 1.539149
H  -2.56302 -1.073897 -1.48157
H  -1.977155 1.674908 2.139138
H  -2.754719 1.659423 0.517873
H  1.212167 -2.126123 -0.533751
H  1.503289 -2.422184 1.216095
H  1.244244 2.139669 -2.049588
H  -2.214305 0.070335 -3.696677
H  -0.296092 1.675667 -3.98605
H  -5.036489 1.394144 1.619339
H  -4.264601 1.411552 3.233578
H  -4.222787 2.874408 2.20489
H  1.144526 -4.923073 0.838608
H  0.860927 -4.612381 -0.901752
H  2.471229 -4.302849 -0.188842
H  2.361939 1.821129 2.166038
H  4.880255 0.725124 0.912595
H  4.882618 2.233192 1.882293
H  4.601944 0.645807 2.682029
