program: Gaussian 09
title: 000080775
version: EM64L-G09RevD.01
frameworkgroup: C1[X(C12H11NO4S)]
method: RPBEPBE
basis: SDD
operation: Freq
keyword: #p
keyword: freq=noraman
keyword: PBEPBE/SDD
title: #p freq=noraman PBEPBE/SDD
converged: YES YES NO NO
title: Mulliken charges:
elementType: S O O O O N C C C C C C C C C C C C H H H H H H H H H H H
charge: 0.995367 -0.292885 -0.558770 -0.508063 -0.498488 -0.700820 -0.252379 0.406667 -0.467658 0.562389 -0.286542 -0.413565 0.356655 -0.339880 -0.384276 -0.211154 -0.193100 -0.251786 0.293423 0.272183 0.229419 0.267679 0.263787 0.315277 0.322041 0.229144 0.231228 0.230779 0.383327
chargesum: 0.00000
title: Mulliken charges with hydrogens summed into heavy atoms:
elementType: S O O O O N C C C C C C C C C C C C
charge: 0.995367 -0.292885 -0.175443 -0.508063 -0.498488 -0.063502 -0.252379 0.406667 -0.174235 0.562389 -0.014359 -0.184146 0.356655 -0.072201 -0.120488 0.017990 0.038128 -0.021007
polarizability: 2.51720123e+02 -1.74187754e+01 1.66610214e+02 9.71970030e+00 -1.28818152e+01 1.21972464e+02
1716.lowfreq: -6.1274 -1.6157 -0.0015 0.0015 0.0016 4.0290 20.6429 28.6490 42.7272
frequency: 20.3879 28.6266 42.6921 56.6035 104.5811 111.1707 137.2809 149.4526 189.6363 199.9344 237.1797 245.1489 275.4671 314.6233 319.9646 331.3412 349.1999 364.9326 407.6109 408.8443 425.6061 446.7136 473.2948 484.4888 517.2342 536.7161 570.5748 607.2598 613.3533 665.2318 689.0806 701.6408 732.1061 761.8510 820.0372 829.1756 833.0814 839.6373 876.3736 876.8018 902.5390 944.5575 951.0446 966.1886 986.0679 987.0594 1001.9296 1019.0597 1037.1839 1073.2612 1077.9981 1141.0310 1159.3548 1170.3377 1185.3931 1217.3513 1250.2226 1308.8875 1322.4488 1374.1948 1387.5286 1437.1726 1442.5825 1469.4603 1498.7689 1563.4550 1596.1418 1607.1098 1636.2650 1649.9448 3132.6785 3134.6109 3142.6358 3146.0811 3158.8348 3163.5072 3168.2380 3176.5433 3483.6185 3568.1189 3707.3491
redmass: 6.3676 4.1368 6.0158 4.6853 6.1341 3.4848 2.4541 5.3531 5.5908 6.1856 2.9228 6.8927 6.4191 5.8345 6.4306 5.0657 3.6345 1.1887 1.2480 2.9155 7.3241 3.3493 4.7177 3.3726 7.2737 9.4024 7.9321 4.9002 4.4862 7.1418 2.3558 4.0891 3.3840 1.7407 1.7786 4.5210 1.2951 6.9971 5.5100 1.6424 1.4165 5.5677 1.3743 1.3664 2.2030 2.0961 2.7876 2.0939 1.4810 1.3388 1.5013 1.3480 1.6251 1.0947 1.5271 2.3014 1.7230 1.3464 2.8693 4.2877 8.3621 4.0165 2.4202 2.2484 3.6576 7.5322 6.3790 6.4558 2.6443 1.5984 1.0851 1.0890 1.0894 1.0916 1.0933 1.0958 1.0961 1.1002 1.0662 1.0453 1.1042
irintensity: 2.1376 0.8924 8.6703 5.8414 5.1871 31.2093 67.9059 1.8084 0.1620 3.9327 16.3068 11.6346 15.6027 9.6829 7.1627 1.0235 7.0376 12.2287 302.0728 0.3001 71.0627 6.7442 16.4128 2.0797 0.5124 120.2685 17.0098 1.8137 2.7751 6.8150 25.0100 3.9651 20.2778 77.6418 36.1165 23.0203 8.1733 119.3097 17.8150 24.9543 4.8286 78.9489 0.0693 0.6347 0.9822 0.2201 1.9619 15.1341 3.5136 52.5398 16.1741 25.1530 58.3490 5.4704 11.7261 322.1436 60.6726 0.7669 16.6054 15.6416 0.1482 16.6954 2.7064 207.0459 305.5521 14.2733 33.4631 32.1107 4.2983 267.7029 1.5088 15.6833 13.3380 12.0530 29.7082 4.2579 8.9908 7.2054 46.4887 112.0399 26.7469
temp: 298.150 k
press: 1.00000 atm
elementType: 16 8 8 8 8 7 6 6 6 6 6 6 6 6 6 6 6 6 1 1 1 1 1 1 1 1 1 1 1
symmnumber: 1
zpe: 543952.1 jmol-1
zpe.correction: 0.207180 hartree
zpe.thermalcorrener: 0.224768 hartree
zpe.thermalcorrenthalpy: 0.225712 hartree
zpe.thermalcorrgfe: 0.160196 hartree
zpe.sumelectzpe: -1216.098394 hartree
zpe.sumelectthermal: -1216.080807 hartree
zpe.sumelectthermalent: -1216.079863 hartree
zpe.sumelectthermalfe: -1216.145379 hartree
dipole: -0.1938 -6.8228 0.8682
dipole: 6.8806
quadrupole: -89.0996 -106.5436 -116.9255
quadrupole: -22.0430 0.5239 0.3961
quadrupole: 15.0900 -2.3540 -12.7359 -22.0430 0.5239 0.3961
hfenergy: -1216.3055747 hartree
pointgroup: C01 [X(C12H11N1O4S1)]
dipole: 0.079057 2.6473868 0.5595661 debye
polarizability: 251.7749183|-16.8807546|164.3022999|-10.2641754|16.2549009|124.2255822 unknown
InChI: InChI=1S/C12H11NO4S/c13-9-6-7-11(12(8-9)18(14,15)16)17-10-4-2-1-3-5-10/h1-8,14H,13H2
charge 0 multiplicity 1
29 atoms
S  -1.646827 -2.086825 -0.072818
O  0.658642 -0.209173 -0.871228
O  -0.365105 -2.262341 1.262313
O  -3.076648 -2.554814 0.518115
O  -1.067647 -2.803823 -1.401403
N  -4.12595 2.481147 0.528761
C  -1.655196 -0.209688 -0.117963
C  -0.480998 0.495417 -0.442673
C  -2.871435 0.4066 0.20551
C  -2.938117 1.828196 0.213555
C  -0.554818 1.908807 -0.430952
C  -1.755824 2.562753 -0.107672
C  1.923908 0.053141 -0.272412
C  2.062433 0.522548 1.052976
C  3.047549 -0.25861 -1.067423
C  3.363045 0.693808 1.578769
C  4.339008 -0.086452 -0.52393
C  4.50321 0.394723 0.797196
H  -3.737402 -0.21368 0.461643
H  0.339274 2.487072 -0.68479
H  -1.786525 3.658454 -0.109934
H  1.179334 0.722626 1.667216
H  2.893512 -0.631369 -2.084303
H  -4.177283 3.495426 0.534182
H  -4.965729 1.957227 0.756911
H  3.481039 1.050683 2.607875
H  5.216379 -0.326724 -1.134258
H  5.506898 0.528108 1.21418
H  0.240873 -3.001337 0.963556
