program: Gaussian 09
title: 000080719
version: EM64L-G09RevD.01
frameworkgroup: C1[X(C12H9N3O)]
method: RPBEPBE
basis: SDD
operation: Freq
keyword: #p
keyword: freq=noraman
keyword: PBEPBE/SDD
title: #p freq=noraman PBEPBE/SDD
converged: NO YES NO YES
title: Mulliken charges:
elementType: O N N N C C C C C C C C C C C C H H H H H H H H H
charge: -0.269488 -0.472689 0.027077 -0.690627 0.426207 0.420505 -0.044995 -0.044413 -0.616219 -0.305938 -0.560760 0.581120 -0.279235 -0.444963 0.161721 -0.320076 0.316661 0.226862 0.262587 0.248956 0.258561 0.228921 0.254332 0.316059 0.319833
chargesum: 0.00000
title: Mulliken charges with hydrogens summed into heavy atoms:
elementType: O N N N C C C C C C C C C C C C
charge: -0.269488 -0.156027 0.027077 -0.054734 0.426207 0.420505 -0.044995 -0.044413 -0.389357 -0.043351 -0.311803 0.581120 -0.020674 -0.216043 0.161721 -0.065744
polarizability: 4.01220570e+02 -7.59918628e+00 1.48830987e+02 3.54289223e-03 -1.53071683e-02 5.88047875e+01
1716.lowfreq: -0.0009 -0.0003 0.0008 7.2686 7.5470 7.8897 64.2087 86.5209 168.4222
frequency: 64.2085 86.5205 168.4220 175.6188 194.9214 267.5706 313.3728 315.4364 338.1060 408.1547 410.5757 428.5723 441.2769 451.9489 466.9551 467.6603 489.5660 573.7332 583.3524 624.4527 629.3764 629.8695 693.5414 713.9606 734.5605 746.9658 769.6908 816.1690 822.9056 827.1542 843.2233 847.1599 865.3783 902.1933 952.9219 960.7121 985.0156 1043.4795 1102.2439 1132.8906 1194.3331 1212.1113 1234.6789 1246.7106 1265.3274 1296.7374 1350.4473 1358.4339 1374.1704 1419.2445 1427.1538 1458.2873 1493.2815 1519.8980 1537.3883 1552.1398 1583.6168 1628.7843 1645.9057 1653.4248 3115.7403 3129.5292 3136.9636 3140.4109 3165.0313 3170.4130 3524.6484 3559.0902 3697.9881
redmass: 6.8374 4.5445 5.8092 5.7856 5.0849 4.4332 4.7843 4.5473 7.9674 4.4019 1.0414 2.5020 2.6337 1.7833 2.5251 8.5678 4.1187 8.2276 7.3325 3.5035 1.9390 6.1312 1.7150 7.1806 2.6996 6.3347 2.5352 1.5871 5.4488 1.7011 4.9788 2.1008 1.8970 3.3678 2.6492 1.3508 1.3012 1.4934 1.4445 1.3740 2.2559 1.5437 1.8643 2.4911 1.8037 2.2212 3.6522 2.8551 3.9265 4.5157 2.8704 5.8301 5.2782 4.2188 6.2524 7.3848 4.5323 5.3533 1.6657 2.5581 1.0913 1.0918 1.0891 1.0869 1.0992 1.0962 1.0767 1.0453 1.1040
irintensity: 0.2543 5.0382 5.1084 0.5518 0.7198 4.2252 3.6531 4.7413 1.5282 12.0345 4.7611 94.4257 5.5750 205.5020 7.0987 30.9734 1.5990 2.0224 3.3412 0.1611 0.5531 5.1252 63.0553 5.0624 0.4242 0.1935 3.5459 27.2546 1.9291 14.7710 16.3075 57.7771 123.5603 7.3437 1.1953 0.2155 0.0606 0.5944 42.2914 54.3604 4.7933 54.3096 5.3458 7.6819 17.6828 3.4151 136.5942 10.9925 80.5084 29.4617 55.0887 126.8033 105.1946 39.8127 142.4159 28.3066 4.8718 720.8355 12.6188 387.8967 17.2710 8.4109 13.7877 0.4435 17.4532 9.8154 16.9123 194.5138 26.6200
temp: 298.150 k
press: 1.00000 atm
elementType: 8 7 7 7 6 6 6 6 6 6 6 6 6 6 6 6 1 1 1 1 1 1 1 1 1
symmnumber: 1
zpe: 492752.2 jmol-1
zpe.correction: 0.187679 hartree
zpe.thermalcorrener: 0.199762 hartree
zpe.thermalcorrenthalpy: 0.200706 hartree
zpe.thermalcorrgfe: 0.149856 hartree
zpe.sumelectzpe: -701.074487 hartree
zpe.sumelectthermal: -701.062404 hartree
zpe.sumelectthermalent: -701.061460 hartree
zpe.sumelectthermalfe: -701.112310 hartree
dipole: -10.9306 -1.7517 0.0008
dipole: 11.0701
quadrupole: -93.3315 -81.4943 -97.7552
quadrupole: 18.0203 -0.0064 -0.0035
quadrupole: -2.4712 9.3660 -6.8949 18.0203 -0.0064 -0.0035
hfenergy: -701.2621664 hartree
pointgroup: C01 [X(C12H9N3O1)]
dipole: 4.2958241 -0.7174284 -0.000302 debye
dipolederiv: -1.4572039 -0.1901153 -0.0000474 -0.5749765 -0.5302709 -0.0000344 -0.0001171 -0.0000287 -0.3776735 -0.8669286 -0.2251104 -0.0000437 0.2012105 -0.1214456 0.0000351 0.0000354 0.00003 -0.2895335 1.2613367 -0.006316 -0.0000096 -0.2682724 -0.2262085 -0.0000052 -0.0000731 0.0000019 -0.2152154 -1.8848708 0.4944812 -0.0000285 1.0137375 -0.385318 0.0001091 -0.0004468 0.0002107 -0.7097243 0.8085076 0.1260183 0.0000236 -0.4593428 0.2967778 0.0000064 -0.000077 0.0000096 0.1894432 1.0959178 0.1500603 0.0000314 0.4974116 -0.0063968 -0.0000206 0.0000971 -0.0000262 0.1562116 -1.1350389 -0.06933 -0.0000265 0.5323503 -0.2055385 -0.0000303 0.0000645 -0.0000292 -0.0127281 -0.5855682 0.0147606 0.0000003 -0.55533 0.0943146 -0.000008 -0.0000304 0.000002 0.0776969 -0.8904743 0.1117589 0.0000021 -0.1141625 0.038623 0.0000517 -0.0000007 0.000045 -0.3202035 1.0964582 0.0707979 0.0000196 0.1026556 0.1564163 0.000049 0.0000062 0.0000419 -0.0935679 -1.0989026 -0.0623531 -0.0000132 0.0991427 -0.0093615 0.0000621 -0.0000015 0.0000528 -0.2896518 1.7681082 -0.4617583 0.0000355 -1.2666812 0.4751127 -0.0000023 0.0000391 0.0000015 0.1860098 0.3801551 -0.0211647 0.0000042 -0.0743868 0.1202452 0.0000535 -0.0000109 0.0000467 -0.1592119 -0.6130583 0.0272706 0.0000145 1.097837 -0.2255678 0.0000183 0.0002472 0.0000102 -0.2509276 1.3981123 0.1588732 0.0000478 0.3897931 0.5496865 0.0000693 0.0000689 0.000064 0.1613899 -0.0226073 -0.0661788 -0.0000014 -0.5462674 -0.1975356 -0.0000195 -0.0000946 -0.0000113 -0.1358909 0.1097771 0.0014078 0.0000023 -0.0242706 0.1251471 -0.000033 -0.0000056 -0.0000353 0.3108971 0.0360263 -0.0057353 -0.0000026 0.0632442 -0.1200086 -0.0000515 -0.0000003 -0.0000394 0.1892929 0.1144391 0.0282022 0.0000051 -0.0313916 -0.037541 -0.0000354 0.0000034 -0.0000337 0.1502372 0.0520062 0.0406074 0.0000051 -0.0004921 -0.0919633 -0.0000489 0.0000048 -0.0000471 0.1795965 0.0945263 -0.040325 -0.0000095 0.0550963 -0.0664851 -0.0000376 0.0000041 -0.0000368 0.1515148 -0.1281874 -0.0836782 -0.0000211 -0.047109 0.0435313 -0.000024 -0.0000349 -0.0000321 0.1763056 -0.0448224 0.0883681 0.0000101 0.0435933 0.0319012 -0.0000176 0.0000077 -0.0000199 0.1566277 0.1871641 -0.0446506 -0.000012 -0.1598802 0.1645621 -0.0000646 0.000118 -0.0001295 0.3839323 0.3251279 -0.0358908 0.0000137 0.0264911 0.1273236 -0.0000215 0.0001966 -0.0000468 0.3851727 unknown
polarizability: 401.309586|5.9391079|148.7419707|0.0036435|0.0152835|58.8047875 unknown
InChI: InChI=1S/C12H9N3O/c13-7-1-3-9-11(5-7)15-12-6-8(16)2-4-10(12)14-9/h1-6,15H,13H2
charge 0 multiplicity 1
25 atoms
O  -4.850844 -1.183375 -0.000286
N  0.011482 -1.242317 -0.000243
N  -0.032287 1.578626 0.000253
N  4.903149 -1.148157 -0.000095
C  1.22767 -0.563341 -0.00014
C  -1.237079 -0.596045 -0.000112
C  1.169778 0.881608 0.000114
C  -1.184626 0.879806 0.000183
C  2.463687 -1.242771 -0.000266
C  2.401265 1.598772 0.000253
C  -2.440348 -1.284223 -0.000246
C  3.675497 -0.501398 -0.00014
C  -2.449725 1.588959 0.000232
C  3.628864 0.936428 0.000136
C  -3.717417 -0.57358 -0.000155
C  -3.647684 0.911172 0.000098
H  0.018819 -2.265359 -0.000421
H  2.491603 -2.339804 -0.000429
H  2.343578 2.691413 0.00046
H  -2.481285 -2.380412 -0.000444
H  -2.393557 2.682625 0.000407
H  4.565878 1.504606 0.000286
H  -4.608495 1.438554 0.00016
H  4.965269 -2.162625 -0.000424
H  5.769608 -0.61696 -0.000179
