program: Gaussian 09
title: 000080724
version: EM64L-G09RevD.01
frameworkgroup: C1[X(C19H14O)]
method: RPBEPBE
basis: SDD
operation: Freq
keyword: #pfreq=noraman
keyword: PBEPBE/SDD
title: #p freq=noraman PBEPBE/SDD
converged: YES YES NO NO
title: Mulliken charges:
elementType: O C C C C C C C C C C C C C C C C C C C H H H H H H H H H H H H H H
charge: -0.291546 0.334656 0.278367 0.145935 0.233853 -0.085957 0.517241 -0.780079 0.418224 -0.449104 -0.478860 -0.346350 -0.387149 -0.464687 -0.436413 -0.260875 -0.248265 -0.243140 -0.250479 -0.530032 0.231949 0.270692 0.234425 0.222957 0.268668 0.246539 0.240181 0.227705 0.229306 0.228158 0.229357 0.229846 0.235172 0.229706
chargesum: 0.00000
title: Mulliken charges with hydrogens summed into heavy atoms:
elementType: O C C C C C C C C C C C C C C C C C C C
charge: -0.291546 0.334656 0.278367 0.145935 0.233853 -0.085957 0.517241 -0.548131 0.418224 -0.178412 -0.244435 -0.123393 -0.118481 -0.218148 -0.196232 -0.033171 -0.018958 -0.014982 -0.021122 0.164692
polarizability: 3.91188882e+02 -1.22439055e+01 2.34080199e+02 -2.58223454e+00 -7.90365303e+00 8.57913157e+01
1716.lowfreq: -4.2004 -2.4634 0.0002 0.0005 0.0005 9.1910 52.4106 65.7244 75.9806
frequency: 52.4091 65.7184 75.9786 108.0688 146.6624 156.5405 162.0352 190.1592 249.9536 275.1966 289.0670 297.8811 331.9867 360.9615 419.3244 438.9658 443.3468 490.9031 512.3445 516.3621 535.0409 571.7743 578.4950 581.8904 641.2345 646.6394 660.0729 706.3287 751.2089 759.4363 762.0277 788.2543 808.6855 812.0928 848.1144 854.0077 867.5662 880.0862 889.3651 920.0295 925.6821 957.3149 966.0095 971.3958 987.2696 993.8241 996.7297 1020.0092 1040.6454 1059.9513 1100.6935 1110.6373 1144.0125 1150.3883 1161.8329 1170.5429 1179.0557 1214.2142 1233.3707 1244.9333 1256.5057 1280.2540 1318.5954 1331.7051 1380.9405 1391.6648 1407.1037 1413.4962 1431.3983 1436.8029 1445.2385 1456.4440 1458.6918 1472.8650 1480.2620 1504.1310 1550.0115 1566.1884 1588.8945 1617.1279 1623.9676 1632.4971 2959.7246 3048.2256 3115.2114 3121.7668 3121.9263 3126.1355 3132.3548 3134.9916 3141.7623 3151.2756 3152.3437 3164.3975 3165.4238 3166.5017
redmass: 3.6026 4.3109 3.5272 3.4996 4.1183 1.3781 2.3664 3.9887 4.0449 5.7086 4.5803 6.6620 3.8579 5.7592 3.1434 3.6330 4.4419 5.8780 6.1238 3.6901 3.4187 3.1665 5.4336 6.8658 4.3477 5.9235 5.7758 3.2165 5.7213 1.3088 1.3227 2.7686 6.3016 1.7820 5.0890 1.8725 1.4317 4.5864 1.7719 6.2631 2.4351 1.3923 6.0491 1.4019 1.3300 1.3291 1.3562 2.1535 2.3225 4.2442 2.2249 1.2400 1.4377 1.4219 1.4014 1.0923 1.0876 1.7065 1.7422 1.7072 1.8546 2.0340 2.7811 2.7779 2.7172 4.7303 2.7499 2.7516 2.0019 3.1918 2.0874 2.8087 1.0540 1.1820 2.2220 3.5370 6.3175 7.5210 5.8435 6.2024 6.7755 6.8985 1.0311 1.1043 1.1011 1.0865 1.0862 1.0881 1.0885 1.0890 1.0916 1.0924 1.0944 1.0962 1.0996 1.0995
irintensity: 1.7426 0.6411 2.9549 1.0714 1.1208 0.5140 0.7070 1.9705 2.2575 3.4835 1.2396 3.0474 4.4499 2.6962 6.9489 1.7064 4.0388 2.5346 0.0559 0.4499 15.9151 2.2190 0.8434 6.2074 1.4328 4.6719 3.1401 8.5247 0.4643 7.6450 103.3874 14.4553 5.6818 0.1558 11.7471 50.9450 16.5070 3.4177 10.0637 3.9449 16.8010 4.3095 29.5240 7.9008 0.0266 0.0956 0.1903 7.8202 3.3115 88.1605 9.9339 0.0658 0.7806 10.8648 8.7961 1.2437 1.2849 1.3305 2.5875 15.4524 23.5599 8.2867 44.1121 33.9806 1.8459 8.8942 2.4051 5.5652 1.6361 0.6020 12.6616 2.8629 12.3208 11.3107 4.3535 29.2990 2.1405 8.1672 4.1288 1.7610 2.5694 3.6574 62.2788 32.4009 31.0835 2.4489 0.2753 9.6947 7.7893 10.7050 7.4039 15.5632 32.7696 24.1754 55.7996 17.0375
temp: 298.150 k
press: 1.00000 atm
elementType: 8 6 6 6 6 6 6 6 6 6 6 6 6 6 6 6 6 6 6 6 1 1 1 1 1 1 1 1 1 1 1 1 1 1
symmnumber: 1
zpe: 704729.4 jmol-1
zpe.correction: 0.268417 hartree
zpe.thermalcorrener: 0.283694 hartree
zpe.thermalcorrenthalpy: 0.284639 hartree
zpe.thermalcorrgfe: 0.226111 hartree
zpe.sumelectzpe: -806.311785 hartree
zpe.sumelectthermal: -806.296508 hartree
zpe.sumelectthermalent: -806.295564 hartree
zpe.sumelectthermalfe: -806.354092 hartree
dipole: -0.0221 -0.0408 1.6713
dipole: 1.6719
quadrupole: -98.6347 -98.9753 -123.5639
quadrupole: 0.2652 3.1874 2.9651
quadrupole: 8.4233 8.0826 -16.5059 0.2652 3.1874 2.9651
hfenergy: -806.5802027 hartree
pointgroup: C01 [X(C19H14O1)]
dipole: 0.0112714 0.0247327 0.6572244 debye
polarizability: 391.7409689|-8.0308536|233.7247449|1.0721193|6.1052284|85.5946827 unknown
InChI: InChI=1S/C19H14O/c1-20-19-16-9-5-3-7-14(16)12-18-15-8-4-2-6-13(15)10-11-17(18)19/h2-12H,1H3
charge 0 multiplicity 1
34 atoms
O  -1.892133 -2.504757 -0.291535
C  0.576429 0.342893 -0.022037
C  0.03412 -1.003132 -0.149032
C  2.039422 0.515172 0.01502
C  -2.281005 -0.094896 -0.109175
C  -1.370844 -1.189705 -0.166356
C  -1.731603 1.244136 0.016343
C  -0.322276 1.425893 0.064866
C  2.888996 -0.64441 -0.083996
C  0.931809 -2.134975 -0.262734
C  2.29827 -1.961348 -0.230246
C  2.662952 1.791699 0.145989
C  -3.705986 -0.268972 -0.178435
C  -2.642168 2.355794 0.088612
C  4.307291 -0.490074 -0.047455
C  4.060055 1.925155 0.18105
C  -4.556635 0.832534 -0.107464
C  -4.020184 2.15759 0.032873
C  4.892935 0.776517 0.083939
C  -2.146891 -3.176379 1.000351
H  0.051945 2.449405 0.168406
H  0.488264 -3.125041 -0.403444
H  2.970526 -2.822277 -0.326092
H  2.050053 2.694978 0.222541
H  -4.100336 -1.280755 -0.314742
H  -2.230661 3.367704 0.184118
H  4.936895 -1.384541 -0.125363
H  4.510002 2.918754 0.283474
H  -5.641759 0.69469 -0.168133
H  -4.703064 3.01247 0.087462
H  5.982643 0.884068 0.110767
H  -1.210722 -3.279632 1.582572
H  -2.54414 -4.171046 0.746038
H  -2.889402 -2.613514 1.598419
