program: Gaussian 09
title: 000080704
version: EM64L-G09RevD.01
frameworkgroup: C1[X(C17H13NO2)]
method: RPBEPBE
basis: SDD
operation: Freq
keyword: #p
keyword: freq=noraman
keyword: PBEPBE/SDD
title: #p freq=noraman PBEPBE/SDD
converged: YES YES NO NO
title: Mulliken charges:
elementType: O O N C C C C C C C C C C C C C C C C C H H H H H H H H H H H H H
charge: -0.434788 -0.261029 -0.479662 0.184965 0.449614 0.348015 -0.472903 -0.475329 -0.377543 -0.412058 -0.239960 0.260366 -0.408075 0.130511 0.245265 -0.343229 -0.354967 -0.223491 -0.237729 -0.227172 0.215725 0.241064 0.311558 0.240448 0.316854 0.228676 0.223950 0.274208 0.219497 0.233334 0.231589 0.233640 0.358657
chargesum: 0.00000
title: Mulliken charges with hydrogens summed into heavy atoms:
elementType: O O N C C C C C C C C C C C C C C C C C
charge: -0.076131 -0.261029 -0.162809 0.184965 0.449614 0.348015 -0.257178 -0.234265 -0.065985 -0.171610 -0.011285 0.260366 -0.184125 0.130511 0.245265 -0.069021 -0.135470 0.009843 -0.006140 0.006468
polarizability: 3.18797240e+02 6.59037821e-01 2.45025192e+02 -8.81635035e+00 6.02597895e+00 8.27186160e+01
1716.lowfreq: -6.3779 -0.0009 -0.0005 -0.0004 3.8860 6.4835 23.3211 38.5493 55.7793
frequency: 23.2370 38.5350 55.7789 77.5112 97.0718 152.6033 160.6939 191.3305 222.3857 242.0775 291.6461 327.1742 334.7013 344.1300 401.8521 413.3832 424.5254 427.7139 470.8190 492.1087 518.0463 521.0637 551.3140 583.8254 613.9338 630.7395 662.8996 669.0909 687.7915 703.3745 704.2933 737.1796 757.5565 779.4867 790.4655 834.8540 848.0300 851.5165 856.8363 873.5836 910.9837 927.3014 934.4447 952.6800 983.3855 989.2252 992.0706 1005.4332 1015.8389 1034.2793 1078.2324 1087.5218 1109.6954 1154.8946 1160.9948 1174.0850 1181.0968 1192.8655 1222.7087 1235.9021 1249.3068 1272.6860 1287.6729 1319.9707 1353.0420 1384.2308 1408.5941 1418.8765 1433.0930 1448.1295 1463.3288 1480.0882 1494.2114 1536.6969 1577.2699 1590.0863 1605.0547 1610.4759 1614.0028 1647.8472 3112.9770 3116.5828 3129.2768 3132.7526 3136.2965 3145.4627 3145.6063 3155.3780 3158.9266 3170.4978 3193.6419 3559.3738 3590.0279
redmass: 5.2220 4.4842 5.5393 6.1350 4.6365 5.0042 4.7441 4.5946 6.6787 4.7512 6.4502 1.3911 2.4698 6.3976 2.8157 3.9382 6.8850 3.4342 4.2309 4.9055 6.2459 3.2067 2.4941 6.6855 6.0716 1.4800 3.7664 6.5025 4.9649 2.5502 2.4203 6.0317 1.7384 1.3671 2.3778 1.6766 2.3392 1.9913 1.9986 6.0735 5.3444 1.3216 1.4605 1.4132 1.4572 4.9371 1.3443 1.3428 3.5763 2.2834 2.0362 1.6747 2.2671 1.2916 1.3645 1.0584 1.1967 1.1194 2.1959 1.7677 2.7791 2.0799 2.5699 1.3489 2.2464 8.7955 3.3090 5.1889 2.2743 2.6165 2.8902 2.4292 2.5715 3.1680 5.5230 7.2242 7.1699 6.3251 4.1596 6.0270 1.0881 1.0875 1.0874 1.0866 1.0902 1.0968 1.0918 1.0965 1.0955 1.1007 1.0945 1.0748 1.0662
irintensity: 2.2076 1.3785 0.7477 2.0797 0.5470 4.3029 4.6110 0.7291 1.3785 0.2438 12.9296 128.8781 16.2141 3.4853 0.1982 3.6255 1.7829 6.8469 6.5736 2.7225 0.2020 1.7085 1.1389 32.0997 1.9094 49.0278 10.7955 6.1172 8.9177 43.6637 69.3986 0.3280 10.3570 1.1824 20.4850 135.3620 4.5724 0.7061 5.2986 10.3662 52.9320 3.5112 4.7496 0.3966 2.4115 0.3051 6.7786 1.5879 16.3674 2.2463 9.2915 20.0752 13.8948 16.6924 219.6284 1.9380 7.3438 11.7489 28.7514 6.9799 107.0613 11.2572 93.1853 4.4932 40.2775 0.6256 74.8195 53.1993 2.5407 29.9159 56.1648 29.4763 364.3515 293.8730 62.1542 7.3980 69.4940 5.5291 12.5201 65.4482 15.9406 10.5762 1.6680 0.9308 19.9959 16.0789 20.7944 31.2852 14.9492 24.3666 7.4879 14.3743 57.8579
temp: 298.150 k
press: 1.00000 atm
elementType: 8 8 7 6 6 6 6 6 6 6 6 6 6 6 6 6 6 6 6 6 1 1 1 1 1 1 1 1 1 1 1 1 1
symmnumber: 1
zpe: 667816.9 jmol-1
zpe.correction: 0.254358 hartree
zpe.thermalcorrener: 0.270450 hartree
zpe.thermalcorrenthalpy: 0.271394 hartree
zpe.thermalcorrgfe: 0.209502 hartree
zpe.sumelectzpe: -859.463911 hartree
zpe.sumelectthermal: -859.447819 hartree
zpe.sumelectthermalent: -859.446875 hartree
zpe.sumelectthermalfe: -859.508767 hartree
dipole: -2.0271 3.9212 -0.0082
dipole: 4.4142
quadrupole: -83.3549 -109.4517 -122.2978
quadrupole: 0.9432 -1.5733 1.9362
quadrupole: 21.6799 -4.4169 -17.2630 0.9432 -1.5733 1.9362
hfenergy: -859.7182692 hartree
pointgroup: C01 [X(C17H13N1O2)]
dipole: -0.7901757 -1.5438026 -0.0910772 debye
polarizability: 318.7243879|-0.9082265|243.7461759|9.7358768|15.5537709|84.0704841 unknown
InChI: InChI=1S/C17H13NO2/c19-14-10-9-12-7-4-8-16(15(12)11-14)18-17(20)13-5-2-1-3-6-13/h1-11,18-19H
charge 0 multiplicity 1
33 atoms
O  -2.659023 -3.573586 -0.012987
O  1.861271 2.358646 0.17067
N  0.504496 0.440908 0.017497
C  -1.926914 0.074118 -0.00979
C  -3.266664 0.630296 -0.039883
C  -0.802958 0.99565 0.008042
C  -1.77893 -1.350383 0.000022
C  -3.456683 2.05004 -0.045325
C  -1.025872 2.38357 0.007773
C  -4.387036 -0.262651 -0.062508
C  -2.353253 2.9022 -0.020222
C  -2.897714 -2.187361 -0.02292
C  -4.221192 -1.64631 -0.055987
C  1.736986 1.09945 0.057533
C  2.941357 0.19329 -0.023056
C  4.162584 0.69026 0.50091
C  2.920053 -1.093642 -0.625183
C  5.333493 -0.093235 0.452209
C  4.094715 -1.87585 -0.677646
C  5.302354 -1.38161 -0.132882
H  -0.805268 -1.85073 0.034519
H  -4.476745 2.449886 -0.067381
H  -0.165911 3.054431 0.03386
H  -5.395553 0.165818 -0.08568
H  0.555945 -0.577594 0.028816
H  -2.493052 3.988287 -0.021287
H  -5.09163 -2.314632 -0.074553
H  4.16671 1.696319 0.932704
H  2.010172 -1.481249 -1.101213
H  6.268968 0.298447 0.866224
H  4.070385 -2.862243 -1.153471
H  6.212465 -1.99014 -0.174303
H  -3.508555 -4.079602 -0.015202
