program: Gaussian 09
title: 000080709
version: EM64L-G09RevD.01
frameworkgroup: C1[X(C10H9NO6S2)]
method: RPBEPBE
basis: SDD
operation: Freq
keyword: #p
keyword: freq=noraman
keyword: PBEPBE/SDD
title: #p freq=noraman PBEPBE/SDD
converged: YES YES NO NO
title: Mulliken charges:
elementType: S S O O O O O O N C C C C C C C C C C H H H H H H H H H
charge: 0.983750 0.987325 -0.566116 -0.564655 -0.501117 -0.497040 -0.505633 -0.494994 -0.690125 0.242772 0.460970 0.389956 -0.040476 -0.475006 -0.318572 -0.110659 -0.416168 -0.462733 -0.246634 0.293445 0.255176 0.264237 0.283299 0.285990 0.335369 0.337359 0.384729 0.385551
chargesum: 0.00000
title: Mulliken charges with hydrogens summed into heavy atoms:
elementType: S S O O O O O O N C C C C C C C C C C
charge: 0.983750 0.987325 -0.181387 -0.179104 -0.501117 -0.497040 -0.505633 -0.494994 -0.017397 0.242772 0.460970 0.389956 -0.040476 -0.181561 -0.063396 -0.110659 -0.151931 -0.179434 0.039355
polarizability: 3.12680091e+02 -1.18561582e+01 1.97519560e+02 1.43980175e+00 -6.09473126e-02 1.09133695e+02
1716.lowfreq: -7.0277 -2.8832 -0.0019 -0.0016 -0.0009 6.0090 25.4840 31.1911 35.7342
frequency: 24.7639 31.1779 35.7176 80.5830 92.0676 120.3736 126.0691 158.8026 163.7501 172.3536 184.6738 213.0524 226.2502 233.5425 246.1882 268.1324 299.9060 308.0852 327.7996 330.1175 344.1716 378.7431 384.4608 410.7759 433.6005 446.8204 485.8715 490.6029 515.1310 527.2366 527.3928 542.4866 563.3669 609.1546 633.4580 671.3878 740.3031 786.7168 807.4287 818.9475 832.4773 842.0935 871.9801 880.0035 895.6527 908.1619 966.2186 968.6945 986.8774 1014.6939 1048.6663 1051.1769 1072.5493 1102.1725 1112.6214 1160.8940 1220.9200 1261.8474 1306.8440 1362.0973 1402.7675 1407.2929 1440.0156 1464.1018 1525.9532 1578.5823 1605.2348 1616.1177 1656.6155 3144.4675 3150.1326 3151.5126 3167.1207 3176.1454 3478.9591 3480.0165 3567.6071 3702.5653
redmass: 9.5944 8.0099 6.8758 9.4425 7.0960 6.1443 5.6002 3.6028 3.0453 2.0541 2.4583 3.6570 5.1193 3.7251 4.7319 3.8858 5.7527 5.7362 8.1935 10.4553 1.2068 6.5530 5.4700 10.2572 10.6646 2.5166 1.3008 5.5148 6.9665 5.4282 3.9340 10.0626 5.2951 5.1804 7.8117 3.6612 5.3391 2.1735 8.0886 1.3221 11.4918 10.6509 1.6431 4.6557 1.5462 2.0522 14.7213 13.8635 1.4096 1.9889 1.2011 1.1639 2.6795 2.0832 1.9428 1.3625 1.4834 1.5867 1.6637 3.5605 3.1655 8.0694 2.7991 4.0503 5.3515 6.4458 7.0543 6.5521 1.2163 1.0910 1.0894 1.0922 1.0932 1.0972 1.0661 1.0661 1.0460 1.1032
irintensity: 2.7403 2.3018 0.3690 1.4934 0.5058 3.4708 3.3389 17.8533 31.9235 20.5554 27.3128 5.2715 17.7838 37.1151 43.6145 16.9949 50.7175 26.2800 22.2005 2.7248 17.5145 3.1503 3.1073 0.2204 194.6139 80.9515 138.7338 7.0749 5.3087 3.4168 4.6667 283.3629 92.3194 55.0942 5.8157 14.7959 2.0235 2.2751 58.5025 8.3807 8.6815 116.9422 12.1165 1.4931 90.9957 0.9793 89.4781 76.6442 2.6541 5.3510 88.5952 59.2007 69.6922 34.7977 9.1563 8.5169 1.3875 0.6893 3.2391 10.1572 69.3603 15.0720 34.3548 38.7866 75.6191 38.6005 71.3525 20.6337 248.1057 3.2576 3.5229 8.6053 8.4620 3.3521 51.7607 47.9135 97.6602 27.5586
temp: 298.150 k
press: 1.00000 atm
elementType: 16 16 8 8 8 8 8 8 7 6 6 6 6 6 6 6 6 6 6 1 1 1 1 1 1 1 1 1
symmnumber: 1
zpe: 474578.4 jmol-1
zpe.correction: 0.180757 hartree
zpe.thermalcorrener: 0.200537 hartree
zpe.thermalcorrenthalpy: 0.201481 hartree
zpe.thermalcorrgfe: 0.131687 hartree
zpe.sumelectzpe: -1686.954330 hartree
zpe.sumelectthermal: -1686.934551 hartree
zpe.sumelectthermalent: -1686.933607 hartree
zpe.sumelectthermalfe: -1687.003401 hartree
dipole: 0.5001 2.0729 0.0422
dipole: 2.1328
quadrupole: -151.3447 -111.0683 -133.8297
quadrupole: -3.9271 -23.3083 -1.0615
quadrupole: -19.2638 21.0126 -1.7488 -3.9271 -23.3083 -1.0615
hfenergy: -1687.1350876 hartree
pointgroup: C01 [X(C10H9N1O6S2)]
dipole: 0.1885556 0.8171177 0.0290892 debye
polarizability: 312.8758365|-10.5831363|197.2396291|-3.3870548|2.0017873|109.2178808 unknown
InChI: InChI=1S/C10H9NO6S2/c11-10-5-8(19(15,16)17)3-6-1-2-7(4-9(6)10)18(12,13)14/h1-5,12,15H,11H2
charge 0 multiplicity 1
28 atoms
S  -4.337548 -0.258868 -0.06549
S  4.342871 0.07893 0.055501
O  -4.551122 -0.332574 1.778299
O  4.609499 -0.083879 -1.775677
O  -5.116055 1.047473 -0.619434
O  -4.641386 -1.722589 -0.680801
O  4.583624 1.620241 0.489222
O  5.140696 -1.122017 0.787947
N  -0.279953 3.020054 0.062533
C  0.244548 0.601495 0.015097
C  -0.238571 -0.767938 -0.026882
C  -0.706916 1.704405 0.030777
C  -2.48987 0.063666 -0.019288
C  -1.643538 -1.035138 -0.040543
C  1.655265 0.824191 0.025651
C  2.507926 -0.270793 0.007815
C  0.703945 -1.851111 -0.042569
C  -2.088838 1.412106 0.015205
C  2.079056 -1.621712 -0.027148
H  -2.030822 -2.056968 -0.081489
H  2.098521 1.824969 0.063817
H  0.32227 -2.877088 -0.069005
H  -2.841291 2.207331 0.010386
H  2.805357 -2.439057 -0.025928
H  -0.959206 3.776473 0.074883
H  0.702932 3.273587 0.076265
H  -5.519337 -0.510746 1.963311
H  5.596945 -0.056245 -1.941956
